{"text_format":"1","workbook":"xlsx","n_sheets":22,"sheets":["PORTADA","1.ASP SOCIALES Y COM","2.GESTIÓN DE LOS RECURSOS","3.INFRASTRUCTURAS Y SERVICIOS","4.INTEGR AMBIENTAL Y RIESGOS","5.URBANISMO","GRAFICOS","INFORME MEJORAS","ListaCriterios","CALCULOS_din","CALCULOS_din (2)","CALCULOS_din (3)","CALCULOS_din (4)","CALCULOS_din (5)","CALCULOS_din Millores","CALCULOS","ListasValidación","Llista Indicadors Avançats","Llista Indicadors per ambits","Q de Qualitat","DINAMICA-Q","Dinamica_VECTORS"],"not_rendered":{"charts":15,"images":7,"macros":1,"external_links":0,"defined_names":68,"comments":1,"pivot_tables":14},"unopened":[],"bounds":{"document_bytes":16777216,"sheet_cells":100000,"rows_first":2000,"rows_last":500,"rows_between":2000,"halvings":0,"cell_chars":16384,"cell_head_chars":4096},"cells_cut":0,"cells_raw":0,"read":"whole","date_system":"1900"}

{"sheet":"PORTADA","index":0,"n_rows":20,"n_cols":1,"rows_kept":20,"cut":false,"hidden":false,"merged":[[0,0,1,2],[19,0,19,2],[8,0,8,2],[6,0,6,2],[9,0,9,2],[11,0,11,2],[13,0,13,2],[15,0,15,2],[17,0,17,2]]}
["Autoevaluación de la ecoficiencia de un PAE"]
[]
[]
["NOMBRE DEL POLÍGONO"]
["MUNICIPIO"]
[]
["La herramienta se ejecuta mediante la respuesta a preguntas divididas en las 5 áreas temáticas que se exponen a continuación. La tipología de respuestas puede ser de Sí/No, numéricas o de valoración cuantitativa (1-5).\nLos resultados surgen automáticamente en la página \"Resultados\" y en \"Propuestas de mejora\", en función de las respuestas. (Cada pestaña es imprimible en A4 y exportable a PDF)"]
[]
{"$rows_left_out":13}
{"sheet":"1.ASP SOCIALES Y COM","index":1,"n_rows":55,"n_cols":16,"rows_kept":55,"cut":false,"hidden":false,"merged":[[0,8,0,10]]}
[null,null,null,null,null,null,null,null,{"$f":"A7","v":"Aspectos sociales y comunicación"},null,null,"(Ocultar, és automatic)"]
[]
[null,null,null,null,null,null,null,null,{"$f":"C7","v":"Asociacionismo"}]
[]
[null,null,null,null,null,null,null,null,{"$f":"E7","v":"Asociacionismo y relación con empresarios"}]
[]
[{"$f":"ListaCriterios!B2","v":"Aspectos sociales y comunicación"},{"$f":"ListaCriterios!C2","v":"1.1"},{"$f":"ListaCriterios!D2","v":"Asociacionismo"},{"$f":"ListaCriterios!E2","v":"1.1.1"},{"$f":"ListaCriterios!F2","v":"Asociacionismo y relación con empresarios"},{"$f":"ListaCriterios!G2","v":"COLABORACIÓN"},{"$f":"ListaCriterios!H2","v":"1.1.1.a"},{"$f":"ListaCriterios!I2","v":0},{"$f":"ListaCriterios!J2","v":"¿Existe asociación de empresarios?"},{"$f":"ListaCriterios!K2","v":"SI/NO"},null,false,false,null,"Sí","1- Gens"]
[{"$f":"ListaCriterios!B3","v":"Aspectos sociales y comunicación"},{"$f":"ListaCriterios!C3","v":"1.1"},{"$f":"ListaCriterios!D3","v":"Asociacionismo"},{"$f":"ListaCriterios!E3","v":"1.1.1"},{"$f":"ListaCriterios!F3","v":"Asociacionismo y relación con empresarios"},{"$f":"ListaCriterios!G3","v":"COLABORACIÓN"},{"$f":"ListaCriterios!H3","v":"1.1.1.b"},{"$f":"ListaCriterios!I3","v":0},{"$f":"ListaCriterios!J3","v":"¿Más del 50% de las empresas están asociadas?"},{"$f":"ListaCriterios!K3","v":"SI/NO"},null,null,null,null,"No","2- Poc"]
{"$rows_left_out":48}
{"sheet":"2.GESTIÓN DE LOS RECURSOS","index":2,"n_rows":95,"n_cols":16,"rows_kept":95,"cut":false,"hidden":false,"merged":[[0,8,0,10]]}
[null,null,null,null,null,null,null,null,{"$f":"A7","v":"Gestión de los recursos"},null,null,"(Ocultar, és automatic)",null,null,"Sí","No"]
[]
[null,null,null,null,null,null,null,null,{"$f":"C7","v":"agua"}]
[]
[null,null,null,null,null,null,null,null,{"$f":"E7","v":"Eficiencia en el consumo de agua"}]
[]
[{"$f":"ListaCriterios!B33","v":"Gestión de los recursos"},{"$f":"ListaCriterios!C33","v":"2.1"},{"$f":"ListaCriterios!D33","v":"agua"},{"$f":"ListaCriterios!E33","v":"2.1.1"},{"$f":"ListaCriterios!F33","v":"Eficiencia en el consumo de agua"},{"$f":"ListaCriterios!G33","v":"AGUA"},{"$f":"ListaCriterios!H33","v":"2.1.1.a"},{"$f":"ListaCriterios!I33","v":"X"},{"$f":"ListaCriterios!J33","v":"¿Se dispone de herramientas por control y datos de consumo de agua (gestor hídrico)?"},{"$f":"ListaCriterios!K33","v":"SI/NO"},null,false,false]
[]
{"$rows_left_out":88}
{"sheet":"3.INFRASTRUCTURAS Y SERVICIOS","index":3,"n_rows":220,"n_cols":16,"rows_kept":220,"cut":false,"hidden":false,"merged":[[0,8,0,10]]}
[null,null,null,null,null,null,null,null,{"$f":"A7","v":"Infrastructuras y servicios"},null,null,"(Ocultar, és automatic)",null,null,"Sí","No"]
[]
[null,null,null,null,null,null,null,null,{"$f":"C7","v":"Infrastructuras avanzadas"}]
[]
[null,null,null,null,null,null,null,null,{"$f":"E7","v":"Red separativa de aguas (pluviales, grises)"}]
[]
[{"$f":"ListaCriterios!B65","v":"Infrastructuras y servicios"},{"$f":"ListaCriterios!C65","v":"3.1"},{"$f":"ListaCriterios!D65","v":"Infrastructuras avanzadas"},{"$f":"ListaCriterios!E65","v":"3.1.1"},{"$f":"ListaCriterios!F65","v":"Red separativa de aguas (pluviales, grises)"},{"$f":"ListaCriterios!G65","v":"AGUA"},{"$f":"ListaCriterios!H65","v":"3.1.1.a"},{"$f":"ListaCriterios!I65","v":"x"},{"$f":"ListaCriterios!J65","v":"¿Existe red de separativa de aguas pluviales?"},{"$f":"ListaCriterios!K65","v":"Grad 1-5"},null,false,false]
[{"$f":"ListaCriterios!B66","v":"Infrastructuras y servicios"},{"$f":"ListaCriterios!C66","v":"3.1"},{"$f":"ListaCriterios!D66","v":"Infrastructuras avanzadas"},{"$f":"ListaCriterios!E66","v":"3.1.1"},{"$f":"ListaCriterios!F66","v":"Red separativa de aguas (pluviales, grises)"},{"$f":"ListaCriterios!G66","v":"AGUA"},{"$f":"ListaCriterios!H66","v":"3.1.1.b"},{"$f":"ListaCriterios!I66","v":"x"},{"$f":"ListaCriterios!J66","v":"¿Existe red de separativa de aguas grises?"},{"$f":"ListaCriterios!K66","v":"Grad 1-5"}]
{"$rows_left_out":213}
{"sheet":"4.INTEGR AMBIENTAL Y RIESGOS","index":4,"n_rows":54,"n_cols":16,"rows_kept":54,"cut":false,"hidden":false,"merged":[[0,8,0,10]]}
[null,null,null,null,null,null,null,null,{"$f":"A7","v":"Integración ambiental y riesgos"},null,null,"(Ocultar, és automatic)",null,null,"Sí","No"]
[]
[null,null,null,null,null,null,null,null,{"$f":"C7","v":"Contaminación luminosa"}]
[]
[null,null,null,null,null,null,null,null,{"$f":"E7","v":"Alumbrado adaptado"}]
[]
[{"$f":"ListaCriterios!B189","v":"Integración ambiental y riesgos"},{"$f":"ListaCriterios!C189","v":"4.1"},{"$f":"ListaCriterios!D189","v":"Contaminación luminosa"},{"$f":"ListaCriterios!E189","v":"4.1.1"},{"$f":"ListaCriterios!F189","v":"Alumbrado adaptado"},{"$f":"ListaCriterios!G189","v":"CALIDAD DEL ESPACIO"},{"$f":"ListaCriterios!H189","v":"4.1.1.a"},{"$f":"ListaCriterios!I189","v":0},{"$f":"ListaCriterios!J189","v":"Proporción de alumbrado adpatado a normativa (%)"},{"$f":"ListaCriterios!K189","v":"Grad 1-5"},null,false,false]
[{"$f":"ListaCriterios!B190","v":"Integración ambiental y riesgos"},{"$f":"ListaCriterios!C190","v":"4.1"},{"$f":"ListaCriterios!D190","v":"Contaminación luminosa"},{"$f":"ListaCriterios!E190","v":"4.1.1"},{"$f":"ListaCriterios!F190","v":"Alumbrado adaptado"},{"$f":"ListaCriterios!G190","v":"CALIDAD DEL ESPACIO"},{"$f":"ListaCriterios!H190","v":"4.1.1.b"},{"$f":"ListaCriterios!I190","v":0},{"$f":"ListaCriterios!J190","v":"¿Existe mapa de protección frente a la contaminación luminosa (zonas E1, E2, E3, E4) disponible y actualizado?"},{"$f":"ListaCriterios!K190","v":"SI/NO"}]
{"$rows_left_out":47}
{"sheet":"5.URBANISMO","index":5,"n_rows":44,"n_cols":16,"rows_kept":44,"cut":false,"hidden":false,"merged":[[0,8,0,10]]}
[null,null,null,null,null,null,null,null,{"$f":"A7","v":"Urbanismo"},null,null,"(Ocultar, és automatic)",null,null,"Sí","No"]
[]
[null,null,null,null,null,null,null,null,{"$f":"C7","v":"Características de las parcelas"}]
[]
[null,null,null,null,null,null,null,null,{"$f":"E7","v":"Grado de ocupación de los PAE"}]
[]
[{"$f":"ListaCriterios!B207","v":"Urbanismo"},{"$f":"ListaCriterios!C207","v":"5.1"},{"$f":"ListaCriterios!D207","v":"Características de las parcelas"},{"$f":"ListaCriterios!E207","v":"5.1.1"},{"$f":"ListaCriterios!F207","v":"Grado de ocupación de los PAE"},{"$f":"ListaCriterios!G207","v":"SUELO"},{"$f":"ListaCriterios!H207","v":"5.1.1.a"},{"$f":"ListaCriterios!I207","v":0},{"$f":"ListaCriterios!J207","v":"Grado de ocupación de los PAE (%)"},{"$f":"ListaCriterios!K207","v":"Grad 1-5"},null,false,false]
[]
{"$rows_left_out":37}
{"sheet":"GRAFICOS","index":6,"n_rows":5,"n_cols":2,"rows_kept":5,"cut":false,"hidden":true,"merged":[[1,0,1,2]]}
[]
["PRESENTACIÓN DE RESULTADOS"]
[]
["POLÍGONO:",{"$f":"PORTADA!B4","v":0}]
["MUNICIPIO:",{"$f":"PORTADA!B5","v":0}]

{"sheet":"INFORME MEJORAS","index":7,"n_rows":69,"n_cols":3,"rows_kept":69,"cut":false,"hidden":true,"merged":[[1,0,1,2],[6,0,6,2]]}
[]
["PRESENTACIÓN DE MEJORAS PRIORITARIAS EN ASPECTOS DE ECOEFICIENCIA"]
[]
["POLÍGONO:",{"$f":"PORTADA!B4","v":0}]
["MUNICIPIO:",{"$f":"PORTADA!B5","v":0}]
[]
[]
[]
{"$rows_left_out":62}
{"sheet":"ListaCriterios","index":8,"n_rows":217,"n_cols":15,"rows_kept":217,"cut":false,"hidden":true,"merged":[]}
["CODI_NIV1","NIVELL 1: GRUP","CODI_NIV2","NIVELL 2: LÍNIA","CODI_NIV3","NIVELL 3: ÍTEM","VECTOR DE SOSTENIBILITAT","CODI_NIV4_IND","AVANÇAT?","NIVELL 4: PARÀMETRE/INDICADOR","Tipus_resp","Justificació de l'ítem","Responsable?","Valor Màxim","Proposta de millora"]
[1,"Aspectos sociales y comunicación","1.1","Asociacionismo","1.1.1","Asociacionismo y relación con empresarios","COLABORACIÓN","1.1.1.a",null,"¿Existe asociación de empresarios?","SI/NO",null,"Asociación o entidad de gestión",{"$f":"VLOOKUP(H2,CALCULOS!H:S,12,FALSE)","v":5}]
[1,"Aspectos sociales y comunicación","1.1","Asociacionismo","1.1.1","Asociacionismo y relación con empresarios","COLABORACIÓN","1.1.1.b",null,"¿Más del 50% de las empresas están asociadas?","SI/NO",null,"Asociación o entidad de gestión",{"$f":"VLOOKUP(H3,CALCULOS!H:S,12,FALSE)","v":5}]
[1,"Aspectos sociales y comunicación","1.1","Asociacionismo","1.1.1","Asociacionismo y relación con empresarios","COLABORACIÓN","1.1.1.c","X","¿La asociación dispone de estructura profesionalizada?","SI/NO",null,"Asociación o entidad de gestión",{"$f":"VLOOKUP(H4,CALCULOS!H:S,12,FALSE)","v":15},"Crear una estructura profesional por la asociación o entidad de gestión del PAE"]
[1,"Aspectos sociales y comunicación","1.1","Asociacionismo","1.1.1","Asociacionismo y relación con empresarios","COLABORACIÓN","1.1.1.d",null,"¿Está inscrita la asociación como APEU?","SI/NO","Llei APEU","Asociación o entidad de gestión",{"$f":"VLOOKUP(H5,CALCULOS!H:S,12,FALSE)","v":5}]
[1,"Aspectos sociales y comunicación","1.1","Asociacionismo","1.1.1","Asociacionismo y relación con empresarios","COLABORACIÓN","1.1.1.e",null,"Actividades divulgativas realizadas por la entidad de gestión en su territorio en los últimos 2 años","Grad 0-5","Surt de la Q","Asociación o entidad de gestión",{"$f":"VLOOKUP(H6,CALCULOS!H:S,12,FALSE)","v":5}]
[1,"Aspectos sociales y comunicación","1.1","Asociacionismo","1.1.1","Asociacionismo y relación con empresarios","COLABORACIÓN","1.1.1.f",null,"Evidencias de proyectos realizados con partes interesadas de su territorio en los últimos 2 años","Grad 0-5","Surt de la Q","Asociación o entidad de gestión",{"$f":"VLOOKUP(H7,CALCULOS!H:S,12,FALSE)","v":5}]
[1,"Aspectos sociales y comunicación","1.1","Asociacionismo","1.1.1","Asociacionismo y relación con empresarios","COLABORACIÓN","1.1.1.g",null,"¿Se han realizado acciones, reuniones o actividades con partes interesadas de su territorio?","SI/NO","Surt de la Q","Asociación o entidad de gestión",{"$f":"VLOOKUP(H8,CALCULOS!H:S,12,FALSE)","v":5}]
{"$rows_left_out":210}
{"sheet":"CALCULOS_din","index":9,"n_rows":12,"n_cols":2,"rows_kept":12,"cut":false,"hidden":true,"merged":[]}
[]
[]
["Row Labels","Suma de Resultat_calculat"]
["Aspectos sociales y comunicación",0.61818181818181817]
["Gestión de los recursos",0.57499999999999996]
["Infrastructuras y servicios",0.51496062992125979]
["Integración ambiental y riesgos",0.41333333333333333]
["Urbanismo",0.72727272727272729]
{"$rows_left_out":5}
{"sheet":"CALCULOS_din (2)","index":10,"n_rows":31,"n_cols":2,"rows_kept":31,"cut":false,"hidden":true,"merged":[]}
[]
[]
["Row Labels","Suma de Resultat_calculat"]
["Aspectos sociales y comunicación",0.61818181818181817]
["Asociacionismo",0.8666666666666667]
["Colaboración",0.46153846153846156]
["Empleo y formación",0.66666666666666663]
["Promoción",0.54666666666666663]
{"$rows_left_out":24}
{"sheet":"CALCULOS_din (3)","index":11,"n_rows":148,"n_cols":2,"rows_kept":148,"cut":false,"hidden":true,"merged":[]}
["NIVELL 1: GRUP","Aspectos sociales y comunicación"]
[]
["Row Labels","Suma de Resultat_calculat"]
["Asociacionismo y relación con empresarios",0.8666666666666667]
["Convenios y relación con otras entidades",0.45454545454545453]
["Convenios con otras entidades",0.5]
["Apoyo al empleo y emprendimiento",0.66666666666666663]
["Comunicación, promoción y señalización",0.54666666666666663]
{"$rows_left_out":141}
{"sheet":"CALCULOS_din (4)","index":12,"n_rows":15,"n_cols":2,"rows_kept":15,"cut":false,"hidden":true,"merged":[]}
[]
[]
["Row Labels","Suma de Resultat_calculat"]
["SOCIAL",0.61212121212121207]
["COLABORACIÓN",0.69729729729729728]
["AGUA",0.77647058823529413]
["ENERGÍA Y CAMBIO CLIMATIC",0.28192771084337348]
["MATERIALES",1]
{"$rows_left_out":8}
{"sheet":"CALCULOS_din (5)","index":13,"n_rows":19,"n_cols":9,"rows_kept":19,"cut":false,"hidden":true,"merged":[]}
["CÀLCULS INCOMPLERT"]
[]
["Cuenta de Respostes","Column Labels"]
["Row Labels",0,1,2,3,4,5,"No","Sí"]
["Aspectos sociales y comunicación",9.6774193548387094E-2,3.2258064516129031E-2,0,0,3.2258064516129031E-2,0,0.22580645161290322,0.61290322580645162]
["Gestión de los recursos",0,9.375E-2,3.125E-2,0,0,9.375E-2,0.3125,0.46875]
["Infrastructuras y servicios",8.0645161290322578E-3,0,0.19354838709677419,0,1.6129032258064516E-2,0,0.33064516129032256,0.45161290322580644]
["Integración ambiental y riesgos",0,5.5555555555555552E-2,0,0.1111111111111111,5.5555555555555552E-2,5.5555555555555552E-2,0.44444444444444442,0.27777777777777779]
{"$rows_left_out":12}
{"sheet":"CALCULOS_din Millores","index":14,"n_rows":65,"n_cols":13,"rows_kept":65,"cut":false,"hidden":true,"merged":[[6,8,6,11],[7,8,7,11],[2,8,2,11],[3,8,3,11],[4,8,4,11]]}
["PRESENTACIÓ DE MILLORES PRIORITÀRIES EN ASPECTES D'ECOEFICIÈNCIA"]
[]
["Valor màxim",15,null,null,null,null,null,null,"VALOR MÀXIM ",null,null,null,{"$f":"CALCULOS!S218","v":2265}]
["Respostes","(Multiple Items)",null,null,null,null,null,null,"VALOR GLOBAL ACTUAL",null,null,null,{"$f":"CALCULOS!R218","v":0}]
["Càlcul","(Multiple Items)",null,null,null,null,null,null,"SUMA AMB MILLORES",null,null,null,{"$f":"SUM(D8:D349)-SUM(C8:C349)","v":756}]
[]
["Row Labels","Suma de Resultat_calculat","Suma de Valor ponderat","Suma de Valor màxim",null,null,null,null,"Realizando las mejoras aumentaríamos la ecoeficiencia en un ",null,null,null,{"$f":"IFERROR(M5/M4,\"-\")","v":"-"}]
["Aspectos sociales y comunicación",null,null,null,null,null,null,null,"Se podría conseguir un valor de",null,null,null,{"$f":"(M4+M5)/M3","v":0.33377483443708611}]
{"$rows_left_out":58}
{"sheet":"CALCULOS","index":15,"n_rows":218,"n_cols":21,"rows_kept":218,"cut":false,"hidden":true,"merged":[]}
["CODI_NIV1","NIVELL 1: GRUP","CODI_NIV2","NIVELL 2: LÍNIA","CODI_NIV3","NIVELL 3: ÍTEM","VECTOR DE SOSTENIBILITAT","CODI_NIV4_IND","AVANÇAT?","NIVELL 4: PARÀMETRE/INDICADOR","Tipus_resp","Respostes","Càlcul","Valor SI","Valor NO","Valor Nul","Ponderació","Valor ponderat","Valor màxim","Result_criteri",{"$f":"ListaCriterios!O1","v":"Proposta de millora"}]
[{"$f":"ListaCriterios!A2","v":1},{"$f":"ListaCriterios!B2","v":"Aspectos sociales y comunicación"},{"$f":"ListaCriterios!C2","v":"1.1"},{"$f":"ListaCriterios!D2","v":"Asociacionismo"},{"$f":"ListaCriterios!E2","v":"1.1.1"},{"$f":"ListaCriterios!F2","v":"Asociacionismo y relación con empresarios"},{"$f":"ListaCriterios!G2","v":"COLABORACIÓN"},{"$f":"ListaCriterios!H2","v":"1.1.1.a"},{"$f":"ListaCriterios!I2","v":0},{"$f":"ListaCriterios!J2","v":"¿Existe asociación de empresarios?"},{"$f":"ListaCriterios!K2","v":"SI/NO"},{"$f":"IF(VLOOKUP(J2,'1.ASP SOCIALES Y COM'!I:K,3,FALSE)=\"\",\"no_data\",VLOOKUP(J2,'1.ASP SOCIALES Y COM'!I:K,3,FALSE))","v":"no_data"},{"$f":"IF(L2=\"no_data\",0,(IF(K2=\"SI/NO\",IF(L2=\"Sí\",N2,IF(L2=\"No\",O2,P2)),L2)))","v":0},5,0,0,1,{"$f":"M2*Q2","v":0},{"$f":"Q2*5","v":5},{"$f":"M2/S2","v":0},{"$f":"ListaCriterios!O2","v":0}]
[{"$f":"ListaCriterios!A3","v":1},{"$f":"ListaCriterios!B3","v":"Aspectos sociales y comunicación"},{"$f":"ListaCriterios!C3","v":"1.1"},{"$f":"ListaCriterios!D3","v":"Asociacionismo"},{"$f":"ListaCriterios!E3","v":"1.1.1"},{"$f":"ListaCriterios!F3","v":"Asociacionismo y relación con empresarios"},{"$f":"ListaCriterios!G3","v":"COLABORACIÓN"},{"$f":"ListaCriterios!H3","v":"1.1.1.b"},{"$f":"ListaCriterios!I3","v":0},{"$f":"ListaCriterios!J3","v":"¿Más del 50% de las empresas están asociadas?"},{"$f":"ListaCriterios!K3","v":"SI/NO"},{"$f":"IF(VLOOKUP(J3,'1.ASP SOCIALES Y COM'!I:K,3,FALSE)=\"\",\"no_data\",VLOOKUP(J3,'1.ASP SOCIALES Y COM'!I:K,3,FALSE))","v":"no_data"},0,5,0,0,1,{"$f":"M3*Q3","v":0},{"$f":"Q3*5","v":5},{"$f":"M3/S3","v":0},{"$f":"ListaCriterios!O3","v":0}]
[{"$f":"ListaCriterios!A4","v":1},{"$f":"ListaCriterios!B4","v":"Aspectos sociales y comunicación"},{"$f":"ListaCriterios!C4","v":"1.1"},{"$f":"ListaCriterios!D4","v":"Asociacionismo"},{"$f":"ListaCriterios!E4","v":"1.1.1"},{"$f":"ListaCriterios!F4","v":"Asociacionismo y relación con empresarios"},{"$f":"ListaCriterios!G4","v":"COLABORACIÓN"},{"$f":"ListaCriterios!H4","v":"1.1.1.c"},{"$f":"ListaCriterios!I4","v":"X"},{"$f":"ListaCriterios!J4","v":"¿La asociación dispone de estructura profesionalizada?"},{"$f":"ListaCriterios!K4","v":"SI/NO"},{"$f":"IF(VLOOKUP(J4,'1.ASP SOCIALES Y COM'!I:K,3,FALSE)=\"\",\"no_data\",VLOOKUP(J4,'1.ASP SOCIALES Y COM'!I:K,3,FALSE))","v":"no_data"},0,5,0,0,3,0,15,0,{"$f":"ListaCriterios!O4","v":"Crear una estructura profesional por la asociación o entidad de gestión del PAE"}]
[{"$f":"ListaCriterios!A5","v":1},{"$f":"ListaCriterios!B5","v":"Aspectos sociales y comunicación"},{"$f":"ListaCriterios!C5","v":"1.1"},{"$f":"ListaCriterios!D5","v":"Asociacionismo"},{"$f":"ListaCriterios!E5","v":"1.1.1"},{"$f":"ListaCriterios!F5","v":"Asociacionismo y relación con empresarios"},{"$f":"ListaCriterios!G5","v":"COLABORACIÓN"},{"$f":"ListaCriterios!H5","v":"1.1.1.d"},{"$f":"ListaCriterios!I5","v":0},{"$f":"ListaCriterios!J5","v":"¿Está inscrita la asociación como APEU?"},{"$f":"ListaCriterios!K5","v":"SI/NO"},{"$f":"IF(VLOOKUP(J5,'1.ASP SOCIALES Y COM'!I:K,3,FALSE)=\"\",\"no_data\",VLOOKUP(J5,'1.ASP SOCIALES Y COM'!I:K,3,FALSE))","v":"no_data"},0,5,0,0,1,0,5,0,{"$f":"ListaCriterios!O5","v":0}]
[{"$f":"ListaCriterios!A6","v":1},{"$f":"ListaCriterios!B6","v":"Aspectos sociales y comunicación"},{"$f":"ListaCriterios!C6","v":"1.1"},{"$f":"ListaCriterios!D6","v":"Asociacionismo"},{"$f":"ListaCriterios!E6","v":"1.1.1"},{"$f":"ListaCriterios!F6","v":"Asociacionismo y relación con empresarios"},{"$f":"ListaCriterios!G6","v":"COLABORACIÓN"},{"$f":"ListaCriterios!H6","v":"1.1.1.e"},{"$f":"ListaCriterios!I6","v":0},{"$f":"ListaCriterios!J6","v":"Actividades divulgativas realizadas por la entidad de gestión en su territorio en los últimos 2 años"},{"$f":"ListaCriterios!K6","v":"Grad 0-5"},{"$f":"IF(VLOOKUP(J6,'1.ASP SOCIALES Y COM'!I:K,3,FALSE)=\"\",\"no_data\",VLOOKUP(J6,'1.ASP SOCIALES Y COM'!I:K,3,FALSE))","v":"no_data"},0,5,0,0,1,0,5,0,{"$f":"ListaCriterios!O6","v":0}]
[{"$f":"ListaCriterios!A7","v":1},{"$f":"ListaCriterios!B7","v":"Aspectos sociales y comunicación"},{"$f":"ListaCriterios!C7","v":"1.1"},{"$f":"ListaCriterios!D7","v":"Asociacionismo"},{"$f":"ListaCriterios!E7","v":"1.1.1"},{"$f":"ListaCriterios!F7","v":"Asociacionismo y relación con empresarios"},{"$f":"ListaCriterios!G7","v":"COLABORACIÓN"},{"$f":"ListaCriterios!H7","v":"1.1.1.f"},{"$f":"ListaCriterios!I7","v":0},{"$f":"ListaCriterios!J7","v":"Evidencias de proyectos realizados con partes interesadas de su territorio en los últimos 2 años"},{"$f":"ListaCriterios!K7","v":"Grad 0-5"},{"$f":"IF(VLOOKUP(J7,'1.ASP SOCIALES Y COM'!I:K,3,FALSE)=\"\",\"no_data\",VLOOKUP(J7,'1.ASP SOCIALES Y COM'!I:K,3,FALSE))","v":"no_data"},0,5,0,0,1,0,5,0,{"$f":"ListaCriterios!O7","v":0}]
[{"$f":"ListaCriterios!A8","v":1},{"$f":"ListaCriterios!B8","v":"Aspectos sociales y comunicación"},{"$f":"ListaCriterios!C8","v":"1.1"},{"$f":"ListaCriterios!D8","v":"Asociacionismo"},{"$f":"ListaCriterios!E8","v":"1.1.1"},{"$f":"ListaCriterios!F8","v":"Asociacionismo y relación con empresarios"},{"$f":"ListaCriterios!G8","v":"COLABORACIÓN"},{"$f":"ListaCriterios!H8","v":"1.1.1.g"},{"$f":"ListaCriterios!I8","v":0},{"$f":"ListaCriterios!J8","v":"¿Se han realizado acciones, reuniones o actividades con partes interesadas de su territorio?"},{"$f":"ListaCriterios!K8","v":"SI/NO"},{"$f":"IF(VLOOKUP(J8,'1.ASP SOCIALES Y COM'!I:K,3,FALSE)=\"\",\"no_data\",VLOOKUP(J8,'1.ASP SOCIALES Y COM'!I:K,3,FALSE))","v":"no_data"},0,5,0,0,1,0,5,0,{"$f":"ListaCriterios!O8","v":0}]
{"$rows_left_out":211}
{"sheet":"ListasValidación","index":16,"n_rows":53,"n_cols":7,"rows_kept":53,"cut":false,"hidden":true,"merged":[]}
["llista_departament","llista_SiNo","llista_1-5","llista_0-5"]
["Via pública","Sí",1,0]
["Medi Ambient","No",2,1]
["Promoció econòmica",null,3,2]
["Policia i protecció civil",null,4,3]
["Urbanisme",null,5,4]
["Associació o entitat de gestió",null,null,5]
[]
{"$rows_left_out":46}
{"sheet":"Llista Indicadors Avançats","index":17,"n_rows":107,"n_cols":2,"rows_kept":107,"cut":false,"hidden":true,"merged":[]}
["LLISTA D'INDICADORS AVANÇATS O POSSIBLES MILLORES"]
["AVANÇAT?","X"]
[]
["Etiquetas de fila"]
["Aspectes socials i comunicació"]
["Disponibilitat o accés a plataforma de teleformació"]
["Es té un recull d'impactes i presència de polígon o de l'entitat de gestió en els mitjans de comunicació?"]
["S'han realitzat accions, reunions o activitats amb administracions publiques del seu territori?"]
{"$rows_left_out":100}
{"sheet":"Llista Indicadors per ambits","index":18,"n_rows":27,"n_cols":2,"rows_kept":27,"cut":false,"hidden":true,"merged":[]}
["NIVELL 1: GRUP","Urbanisme"]
[]
["Etiquetas de fila","NIVELL 4: PARÀMETRE/INDICADOR"]
["Característiques de les parcel·les"]
["Capacitat d’expansió d’implantacions actuals"]
["5.1.4.a","Capacitat d’expansió de les activitats actuals"]
["Grau d'ocupació dels PAE"]
["5.1.1.a","Grau d'ocupació dels PAE (%)"]
{"$rows_left_out":20}
{"sheet":"Q de Qualitat","index":19,"n_rows":193,"n_cols":31,"rows_kept":193,"cut":false,"hidden":true,"merged":[[0,4,0,5],[4,9,4,13],[5,9,5,13],[6,9,6,13],[7,9,7,13],[2,7,2,8],[3,7,3,8],[5,7,5,8],[7,7,7,8],[8,7,8,8],[2,2,2,3],[3,2,3,3],[4,2,4,3],[5,2,5,3]]}
[null,"Versión: Febrero 2018",null,null,"MARCA DE CALIDAD PARA ÁREAS EMPRESARIALES\nPOLÍGONO EMPRESARIAL DE CALIDAD",null,"Leyenda"]
[null,null,null,null,null,null,"*VERIFICACIÓN"]
[null,"Nombre del Polígono",null,null,null,null,"Asociar documentación","Estos requisitos llevarán asociados una evidencia documental que debe estar disponible y accesible en el momento de la auditoria."]
[null,"Nombre de Entidad de gestión",null,null,null,null,"Verificar en auditoría","Estos requisitos pueden conllevar o no evidencia documental. En cualquier caso, se evidenciará en auditoría por ejemplo, a través de la visita al polígono, entrevistas con empresarios y otros implicados, u otros tipos de evidencias. "]
[null,"Fecha Auditoría",null,null,null,null,"**ESTADO: ","A cumplimentar por equipo auditor."]
[null,"Equipo auditor",null,null,null,null,"Adecuado","El estado del requisito se valora como adecuado para el tipo de área industrial en función de su tamaño, tipo de actividad y estado de desarrollo del modelo"]
[]
[null,null,null,null,null,null,"No adecuado","El estado del requisito se valora como no adecuado teniendo en cuenta el tipo de área industrial en función de su tamaño, tipo de actividad o estado de desarrollo del modelo"]
{"$rows_left_out":186}
{"sheet":"DINAMICA-Q","index":20,"n_rows":14,"n_cols":3,"rows_kept":14,"cut":false,"hidden":true,"merged":[]}
[]
[]
["Etiquetas de fila","TEMA","DADES A OBTENIR"]
["3.1.6"]
["Infraestructuras telecomunicaciones"]
["¿ se tiene el Contrato de prestación del servicio de telecomunicaciones (por ejemplo, adjudicación publica del servicio)?"]
["¿se dispone de Documentos oficiales que reflejan las principales características de la red telecomunicaciones (por ejemplo pliego condiciones técnicas de prestación del servicio)?"]
["¿se dispone de Plano de canalizaciones (de ser el caso, por proveedor)?"]
{"$rows_left_out":7}
{"sheet":"Dinamica_VECTORS","index":21,"n_rows":55,"n_cols":1,"rows_kept":55,"cut":false,"hidden":true,"merged":[]}
["ASPECTES ORDENATS PER VECTORS"]
[]
["Etiquetas de fila"]
["AIGUA"]
["Aigua"]
["Infraestructures avançades"]
["Infraestructures bàsiques"]
["COL·LABORACIÓ"]
{"$rows_left_out":47}