{"text_format":"1","workbook":"xlsx","n_sheets":22,"sheets":["PORTADA","1.ASP SOCIALES Y COM","2.GESTIÓN DE LOS RECURSOS","3.INFRASTRUCTURAS Y SERVICIOS","4.INTEGR AMBIENTAL Y RIESGOS","5.URBANISMO","GRAFICOS","INFORME MEJORAS","ListaCriterios","CALCULOS_din","CALCULOS_din (2)","CALCULOS_din (3)","CALCULOS_din (4)","CALCULOS_din (5)","CALCULOS_din Millores","CALCULOS","ListasValidación","Llista Indicadors Avançats","Llista Indicadors per ambits","Q de Qualitat","DINAMICA-Q","Dinamica_VECTORS"],"not_rendered":{"charts":15,"images":7,"macros":1,"external_links":0,"defined_names":68,"comments":1,"pivot_tables":14},"unopened":[],"bounds":{"document_bytes":16777216,"sheet_cells":100000,"rows_first":2000,"rows_last":500,"rows_between":2000,"halvings":0,"cell_chars":16384,"cell_head_chars":4096},"cells_cut":0,"cells_raw":0,"read":"whole","date_system":"1900"}

{"sheet":"PORTADA","index":0,"n_rows":20,"n_cols":1,"rows_kept":20,"cut":false,"hidden":false,"merged":[[0,0,1,2],[19,0,19,2],[8,0,8,2],[6,0,6,2],[9,0,9,2],[11,0,11,2],[13,0,13,2],[15,0,15,2],[17,0,17,2]]}
["Autoevaluación de la ecoficiencia de un PAE"]
[]
[]
["NOMBRE DEL POLÍGONO"]
["MUNICIPIO"]
[]
["La herramienta se ejecuta mediante la respuesta a preguntas divididas en las 5 áreas temáticas que se exponen a continuación. La tipología de respuestas puede ser de Sí/No, numéricas o de valoración cuantitativa (1-5).\nLos resultados surgen automáticamente en la página \"Resultados\" y en \"Propuestas de mejora\", en función de las respuestas. (Cada pestaña es imprimible en A4 y exportable a PDF)"]
[]
["ASPECTOS SOCIALES Y COMUNICACIÓN"]
["Los aspectos sociales y comunicativos son cada vez más importantes para la competitividad y eficiencia de un PAE y se convierten a menudo en requerimientos esenciales para poder desarrollar otros vectores de ecoeficiencia. Se incluyen aspectos como el asociacionismo, la colaboración, la promoción del polígono o acciones relacionadas con la formación y el empleo."]
["GESTIÓN DE LOS RECURSOS"]
["La economía circular busca maximizar el valor de los recursos que, en un territorio, implica evaluar su metabolismo cuantificando los consumos de recursos (minerales, subproductos orgánicos, sal, biomasa forestal, metal...) y su reaprovechamiento. La gestión eficiente de los recursos impacta directamente en el grado de ecoeficiencia de un polígono de actividad económica; por tanto, conocer aspectos relacionados con la gestión del agua, la energía, el cambio climático, el uso de materias primas o la gestión de residuos son aspectos clave."]
["INFRASTRUCTURAS Y SERVICIOS"]
["Las infraestructuras disponibles en el PAE y los servicios que puede ofrecer a las empresas son uno de los principales factores a la hora de ser escogido por una empresa. Y cada vez más, los PAE están llamados cada vez más a ofrecer servicios a sus actividades y trabajadores. Existen servicios e infraestructuras básicas como el abastecimiento de agua, suministro eléctrico, red vial, limpieza vial o alcantarillado, que son incondicionales para alcanzar la ecoeficiencia en un polígono. Sin embargo, en la presente herramienta también se evalúan servicios e infraestructuras \"avanzadas\" que son los que realmente pueden marcar el nivel de ecoeficiencia."]
["INTEGRACIÓN AMBIENTAL Y RIESGOS"]
["Un PAE se integra en un entorno biofísico y humano. La forma en la que se realiza esta integración tiene que ver con su nivel de ecoeficiencia. Así pues, en este apartado se evalúan aspectos como la integración paisajística, la existencia y gestión de los riesgos ambientales como incendios o inundaciones, la gestión del ruido o las posibles afectaciones en el entorno natural (fauna, especies vegetales, etc.) ."]
["URBANISMO"]
["Los aspectos urbanísticos en un PAE condicionan muchos otros parámetros evaluados. En este ámbito se evalúan aspectos urbanísticos que pueden tener relación directa o indirecta con su ecoeficiencia o que pueden ser básicos para el correcto desarrollo del PAE. Se evalúan parámetros sobre las parcelas, el emplazamiento y la situación urbanística administrativa."]
[]
["Esta herramienta se ha diseñado en el marco del Proyecto de Especialización y Competitividad Territorial (PECT) ININVallès \"Vallès Industrial, innovación y diseño de la industria europea\" dentro de la operación 5 \"Impulso de la economía circular a los sistemas industriales\" , liderada por el Ayuntamiento de Sant Quirze del Vallès. Su principal objetivo es la autoevaluación del nivel de ecoeficiencia de un PAE por parte de técnicos municipales o del gestor del polígono y la obtención de una hoja de ruta para la mejora de la ecoeficiencia del polígono industrial. Para cualquier duda o cuestión o propuesta de mejora puede dirigir un correo electrónico a: simbiosy@simbiosy.com "]

{"sheet":"1.ASP SOCIALES Y COM","index":1,"n_rows":55,"n_cols":16,"rows_kept":55,"cut":false,"hidden":false,"merged":[[0,8,0,10]]}
[null,null,null,null,null,null,null,null,{"$f":"A7","v":"Aspectos sociales y comunicación"},null,null,"(Ocultar, és automatic)"]
[]
[null,null,null,null,null,null,null,null,{"$f":"C7","v":"Asociacionismo"}]
[]
[null,null,null,null,null,null,null,null,{"$f":"E7","v":"Asociacionismo y relación con empresarios"}]
[]
[{"$f":"ListaCriterios!B2","v":"Aspectos sociales y comunicación"},{"$f":"ListaCriterios!C2","v":"1.1"},{"$f":"ListaCriterios!D2","v":"Asociacionismo"},{"$f":"ListaCriterios!E2","v":"1.1.1"},{"$f":"ListaCriterios!F2","v":"Asociacionismo y relación con empresarios"},{"$f":"ListaCriterios!G2","v":"COLABORACIÓN"},{"$f":"ListaCriterios!H2","v":"1.1.1.a"},{"$f":"ListaCriterios!I2","v":0},{"$f":"ListaCriterios!J2","v":"¿Existe asociación de empresarios?"},{"$f":"ListaCriterios!K2","v":"SI/NO"},null,false,false,null,"Sí","1- Gens"]
[{"$f":"ListaCriterios!B3","v":"Aspectos sociales y comunicación"},{"$f":"ListaCriterios!C3","v":"1.1"},{"$f":"ListaCriterios!D3","v":"Asociacionismo"},{"$f":"ListaCriterios!E3","v":"1.1.1"},{"$f":"ListaCriterios!F3","v":"Asociacionismo y relación con empresarios"},{"$f":"ListaCriterios!G3","v":"COLABORACIÓN"},{"$f":"ListaCriterios!H3","v":"1.1.1.b"},{"$f":"ListaCriterios!I3","v":0},{"$f":"ListaCriterios!J3","v":"¿Más del 50% de las empresas están asociadas?"},{"$f":"ListaCriterios!K3","v":"SI/NO"},null,null,null,null,"No","2- Poc"]
[{"$f":"ListaCriterios!B4","v":"Aspectos sociales y comunicación"},{"$f":"ListaCriterios!C4","v":"1.1"},{"$f":"ListaCriterios!D4","v":"Asociacionismo"},{"$f":"ListaCriterios!E4","v":"1.1.1"},{"$f":"ListaCriterios!F4","v":"Asociacionismo y relación con empresarios"},{"$f":"ListaCriterios!G4","v":"COLABORACIÓN"},{"$f":"ListaCriterios!H4","v":"1.1.1.c"},{"$f":"ListaCriterios!I4","v":"X"},{"$f":"ListaCriterios!J4","v":"¿La asociación dispone de estructura profesionalizada?"},{"$f":"ListaCriterios!K4","v":"SI/NO"},null,null,null,null,null,"3- Normal"]
[{"$f":"ListaCriterios!B5","v":"Aspectos sociales y comunicación"},{"$f":"ListaCriterios!C5","v":"1.1"},{"$f":"ListaCriterios!D5","v":"Asociacionismo"},{"$f":"ListaCriterios!E5","v":"1.1.1"},{"$f":"ListaCriterios!F5","v":"Asociacionismo y relación con empresarios"},{"$f":"ListaCriterios!G5","v":"COLABORACIÓN"},{"$f":"ListaCriterios!H5","v":"1.1.1.d"},{"$f":"ListaCriterios!I5","v":0},{"$f":"ListaCriterios!J5","v":"¿Está inscrita la asociación como APEU?"},{"$f":"ListaCriterios!K5","v":"SI/NO"},null,null,null,null,null,"4- Bastant"]
[{"$f":"ListaCriterios!B6","v":"Aspectos sociales y comunicación"},{"$f":"ListaCriterios!C6","v":"1.1"},{"$f":"ListaCriterios!D6","v":"Asociacionismo"},{"$f":"ListaCriterios!E6","v":"1.1.1"},{"$f":"ListaCriterios!F6","v":"Asociacionismo y relación con empresarios"},{"$f":"ListaCriterios!G6","v":"COLABORACIÓN"},{"$f":"ListaCriterios!H6","v":"1.1.1.e"},{"$f":"ListaCriterios!I6","v":0},{"$f":"ListaCriterios!J6","v":"Actividades divulgativas realizadas por la entidad de gestión en su territorio en los últimos 2 años"},{"$f":"ListaCriterios!K6","v":"Grad 0-5"},null,null,null,null,null,"5- Molt"]
[{"$f":"ListaCriterios!B7","v":"Aspectos sociales y comunicación"},{"$f":"ListaCriterios!C7","v":"1.1"},{"$f":"ListaCriterios!D7","v":"Asociacionismo"},{"$f":"ListaCriterios!E7","v":"1.1.1"},{"$f":"ListaCriterios!F7","v":"Asociacionismo y relación con empresarios"},{"$f":"ListaCriterios!G7","v":"COLABORACIÓN"},{"$f":"ListaCriterios!H7","v":"1.1.1.f"},{"$f":"ListaCriterios!I7","v":0},{"$f":"ListaCriterios!J7","v":"Evidencias de proyectos realizados con partes interesadas de su territorio en los últimos 2 años"},{"$f":"ListaCriterios!K7","v":"Grad 0-5"}]
[{"$f":"ListaCriterios!B8","v":"Aspectos sociales y comunicación"},{"$f":"ListaCriterios!C8","v":"1.1"},{"$f":"ListaCriterios!D8","v":"Asociacionismo"},{"$f":"ListaCriterios!E8","v":"1.1.1"},{"$f":"ListaCriterios!F8","v":"Asociacionismo y relación con empresarios"},{"$f":"ListaCriterios!G8","v":"COLABORACIÓN"},{"$f":"ListaCriterios!H8","v":"1.1.1.g"},{"$f":"ListaCriterios!I8","v":0},{"$f":"ListaCriterios!J8","v":"¿Se han realizado acciones, reuniones o actividades con partes interesadas de su territorio?"},{"$f":"ListaCriterios!K8","v":"SI/NO"}]
[]
[null,null,null,null,null,null,null,null,{"$f":"C19","v":"Colaboración"}]
[]
[null,null,null,null,null,null,null,null,{"$f":"E19","v":"Convenios y relación con otras entidades"}]
[]
[{"$f":"ListaCriterios!B9","v":"Aspectos sociales y comunicación"},{"$f":"ListaCriterios!C9","v":"1.2"},{"$f":"ListaCriterios!D9","v":"Colaboración"},{"$f":"ListaCriterios!E9","v":"1.2.1"},{"$f":"ListaCriterios!F9","v":"Convenios y relación con otras entidades"},{"$f":"ListaCriterios!G9","v":"COLABORACIÓN"},{"$f":"ListaCriterios!H9","v":"1.2.1.a"},{"$f":"ListaCriterios!I9","v":0},{"$f":"ListaCriterios!J9","v":"Reuniones o contactos informativos realizados con partes interesadas de su territorio en los últimos 2 años"},{"$f":"ListaCriterios!K9","v":"Grad 0-5"}]
[{"$f":"ListaCriterios!B10","v":"Aspectos sociales y comunicación"},{"$f":"ListaCriterios!C10","v":"1.2"},{"$f":"ListaCriterios!D10","v":"Colaboración"},{"$f":"ListaCriterios!E10","v":"1.2.1"},{"$f":"ListaCriterios!F10","v":"Convenios y relación con otras entidades"},{"$f":"ListaCriterios!G10","v":"COLABORACIÓN"},{"$f":"ListaCriterios!H10","v":"1.2.1.b"},{"$f":"ListaCriterios!I10","v":"X"},{"$f":"ListaCriterios!J10","v":"¿Se han realizado acciones, reuniones o actividades con administraciones públicas de su territorio?"},{"$f":"ListaCriterios!K10","v":"SI/NO"}]
[{"$f":"ListaCriterios!B11","v":"Aspectos sociales y comunicación"},{"$f":"ListaCriterios!C11","v":"1.2"},{"$f":"ListaCriterios!D11","v":"Colaboración"},{"$f":"ListaCriterios!E11","v":"1.2.1"},{"$f":"ListaCriterios!F11","v":"Convenios y relación con otras entidades"},{"$f":"ListaCriterios!G11","v":"COLABORACIÓN"},{"$f":"ListaCriterios!H11","v":"1.2.1.c"},{"$f":"ListaCriterios!I11","v":0},{"$f":"ListaCriterios!J11","v":"¿Se han realizado acciones, reuniones o actividades con empresas del área/titulares de parcelas?"},{"$f":"ListaCriterios!K11","v":"SI/NO"}]
[{"$f":"ListaCriterios!B12","v":"Aspectos sociales y comunicación"},{"$f":"ListaCriterios!C12","v":"1.2"},{"$f":"ListaCriterios!D12","v":"Colaboración"},{"$f":"ListaCriterios!E12","v":"1.2.1"},{"$f":"ListaCriterios!F12","v":"Convenios y relación con otras entidades"},{"$f":"ListaCriterios!G12","v":"COLABORACIÓN"},{"$f":"ListaCriterios!H12","v":"1.2.1.d"},{"$f":"ListaCriterios!I12","v":0},{"$f":"ListaCriterios!J12","v":"¿Se han realizado acciones, reuniones o actividades con entidades de formación de su territorio?"},{"$f":"ListaCriterios!K12","v":"SI/NO"}]
[{"$f":"ListaCriterios!B13","v":"Aspectos sociales y comunicación"},{"$f":"ListaCriterios!C13","v":"1.2"},{"$f":"ListaCriterios!D13","v":"Colaboración"},{"$f":"ListaCriterios!E13","v":"1.2.1"},{"$f":"ListaCriterios!F13","v":"Convenios y relación con otras entidades"},{"$f":"ListaCriterios!G13","v":"COLABORACIÓN"},{"$f":"ListaCriterios!H13","v":"1.2.1.e"},{"$f":"ListaCriterios!I13","v":0},{"$f":"ListaCriterios!J13","v":"¿Se han realizado acciones, reuniones o actividades con entidades sociales (asociaciones, sindicatos, vecinales, etc?)."},{"$f":"ListaCriterios!K13","v":"SI/NO"}]
[{"$f":"ListaCriterios!B14","v":"Aspectos sociales y comunicación"},{"$f":"ListaCriterios!C14","v":"1.2"},{"$f":"ListaCriterios!D14","v":"Colaboración"},{"$f":"ListaCriterios!E14","v":"1.2.1"},{"$f":"ListaCriterios!F14","v":"Convenios y relación con otras entidades"},{"$f":"ListaCriterios!G14","v":"COLABORACIÓN"},{"$f":"ListaCriterios!H14","v":"1.2.1.f"},{"$f":"ListaCriterios!I14","v":"X"},{"$f":"ListaCriterios!J14","v":"Se tiene conocimiento sobre necesidades o demandas de las partes interesadas con su correspondiente tratamiento y análisis"},{"$f":"ListaCriterios!K14","v":"SI/NO"}]
[{"$f":"ListaCriterios!B15","v":"Aspectos sociales y comunicación"},{"$f":"ListaCriterios!C15","v":"1.2"},{"$f":"ListaCriterios!D15","v":"Colaboración"},{"$f":"ListaCriterios!E15","v":"1.2.1"},{"$f":"ListaCriterios!F15","v":"Convenios y relación con otras entidades"},{"$f":"ListaCriterios!G15","v":"COLABORACIÓN"},{"$f":"ListaCriterios!H15","v":"1.2.1.g"},{"$f":"ListaCriterios!I15","v":0},{"$f":"ListaCriterios!J15","v":"¿Se han realizado actividades de sensibilización, información o mejora de la conservación de las parcelas de polígono en los últimos 2 años?"},{"$f":"ListaCriterios!K15","v":"SI/NO"}]
[]
[null,null,null,null,null,null,null,null,{"$f":"E29","v":"Convenios con otras entidades"}]
[]
[{"$f":"ListaCriterios!B16","v":"Aspectos sociales y comunicación"},{"$f":"ListaCriterios!C16","v":"1.2"},{"$f":"ListaCriterios!D16","v":"Colaboración"},{"$f":"ListaCriterios!E16","v":"1.2.2"},{"$f":"ListaCriterios!F16","v":"Convenios con otras entidades"},{"$f":"ListaCriterios!G16","v":"COLABORACIÓN"},{"$f":"ListaCriterios!H16","v":"1.2.2.a"},{"$f":"ListaCriterios!I16","v":0},{"$f":"ListaCriterios!J16","v":"¿Se dispone de acuerdos o convenios de colaboración/adhesión con otras entidades de gestión de áreas empresariales para el desarrollo de acciones de interés para el polígono o para el desarrollo de sinergias?"},{"$f":"ListaCriterios!K16","v":"SI/NO"}]
[{"$f":"ListaCriterios!B17","v":"Aspectos sociales y comunicación"},{"$f":"ListaCriterios!C17","v":"1.2"},{"$f":"ListaCriterios!D17","v":"Colaboración"},{"$f":"ListaCriterios!E17","v":"1.2.2"},{"$f":"ListaCriterios!F17","v":"Convenios con otras entidades"},{"$f":"ListaCriterios!G17","v":"COLABORACIÓN"},{"$f":"ListaCriterios!H17","v":"1.2.2.b"},{"$f":"ListaCriterios!I17","v":0},{"$f":"ListaCriterios!J17","v":"Ha participado la entidad de gestión en eventos, jornadas o grupos de trabajo en materia de dinamización de áreas empresariales"},{"$f":"ListaCriterios!K17","v":"SI/NO"}]
[]
[null,null,null,null,null,null,null,null,{"$f":"C36","v":"Empleo y formación"}]
[]
[null,null,null,null,null,null,null,null,{"$f":"E36","v":"Apoyo al empleo y emprendimiento"}]
[]
[{"$f":"ListaCriterios!B18","v":"Aspectos sociales y comunicación"},{"$f":"ListaCriterios!C18","v":"1.3"},{"$f":"ListaCriterios!D18","v":"Empleo y formación"},{"$f":"ListaCriterios!E18","v":"1.3.1"},{"$f":"ListaCriterios!F18","v":"Apoyo al empleo y emprendimiento"},{"$f":"ListaCriterios!G18","v":"SOCIAL"},{"$f":"ListaCriterios!H18","v":"1.3.1.a"},{"$f":"ListaCriterios!I18","v":"X"},{"$f":"ListaCriterios!J18","v":"¿Se ha interaccionado con entidades educativas para acercar el polígono a esta actividad?"},{"$f":"ListaCriterios!K18","v":"SI/NO"}]
[{"$f":"ListaCriterios!B19","v":"Aspectos sociales y comunicación"},{"$f":"ListaCriterios!C19","v":"1.3"},{"$f":"ListaCriterios!D19","v":"Empleo y formación"},{"$f":"ListaCriterios!E19","v":"1.3.1"},{"$f":"ListaCriterios!F19","v":"Apoyo al empleo y emprendimiento"},{"$f":"ListaCriterios!G19","v":"SOCIAL"},{"$f":"ListaCriterios!H19","v":"1.3.1.b"},{"$f":"ListaCriterios!I19","v":0},{"$f":"ListaCriterios!J19","v":"¿Ha habido algún tipo de interrelación, sensibilización o dinamización del ámbito de la educación reglada en el polígono empresarial?"},{"$f":"ListaCriterios!K19","v":"SI/NO"}]
[{"$f":"ListaCriterios!B20","v":"Aspectos sociales y comunicación"},{"$f":"ListaCriterios!C20","v":"1.3"},{"$f":"ListaCriterios!D20","v":"Empleo y formación"},{"$f":"ListaCriterios!E20","v":"1.3.1"},{"$f":"ListaCriterios!F20","v":"Apoyo al empleo y emprendimiento"},{"$f":"ListaCriterios!G20","v":"SOCIAL"},{"$f":"ListaCriterios!H20","v":"1.3.1.c"},{"$f":"ListaCriterios!I20","v":0},{"$f":"ListaCriterios!J20","v":"¿Se dispone de bolsa de empleo o similar de acceso público online?"},{"$f":"ListaCriterios!K20","v":"SI/NO"}]
[{"$f":"ListaCriterios!B21","v":"Aspectos sociales y comunicación"},{"$f":"ListaCriterios!C21","v":"1.3"},{"$f":"ListaCriterios!D21","v":"Empleo y formación"},{"$f":"ListaCriterios!E21","v":"1.3.1"},{"$f":"ListaCriterios!F21","v":"Apoyo al empleo y emprendimiento"},{"$f":"ListaCriterios!G21","v":"SOCIAL"},{"$f":"ListaCriterios!H21","v":"1.3.1.d"},{"$f":"ListaCriterios!I21","v":"X"},{"$f":"ListaCriterios!J21","v":"Actividades de divulgación y promoción del empleo y el emprendimiento entre las empresas del polígono en los últimos 2 años"},{"$f":"ListaCriterios!K21","v":"Grad 1-5"}]
[{"$f":"ListaCriterios!B22","v":"Aspectos sociales y comunicación"},{"$f":"ListaCriterios!C22","v":"1.3"},{"$f":"ListaCriterios!D22","v":"Empleo y formación"},{"$f":"ListaCriterios!E22","v":"1.3.1"},{"$f":"ListaCriterios!F22","v":"Apoyo al empleo y emprendimiento"},{"$f":"ListaCriterios!G22","v":"SOCIAL"},{"$f":"ListaCriterios!H22","v":"1.3.1.e"},{"$f":"ListaCriterios!I22","v":"X"},{"$f":"ListaCriterios!J22","v":"Disponibilidad o acceso a plataforma de teleformación"},{"$f":"ListaCriterios!K22","v":"SI/NO"}]
[{"$f":"ListaCriterios!B23","v":"Aspectos sociales y comunicación"},{"$f":"ListaCriterios!C23","v":"1.3"},{"$f":"ListaCriterios!D23","v":"Empleo y formación"},{"$f":"ListaCriterios!E23","v":"1.3.1"},{"$f":"ListaCriterios!F23","v":"Apoyo al empleo y emprendimiento"},{"$f":"ListaCriterios!G23","v":"SOCIAL"},{"$f":"ListaCriterios!H23","v":"1.3.1.g"},{"$f":"ListaCriterios!I23","v":"X"},{"$f":"ListaCriterios!J23","v":"¿Se han realizado acciones en el ámbito de la formación para el empleo en el polígono empresarial, de acuerdo con las necesidades de las empresas?"},{"$f":"ListaCriterios!K23","v":"SI/NO"}]
[{"$f":"ListaCriterios!B24","v":"Aspectos sociales y comunicación"},{"$f":"ListaCriterios!C24","v":"1.3"},{"$f":"ListaCriterios!D24","v":"Empleo y formación"},{"$f":"ListaCriterios!E24","v":"1.3.1"},{"$f":"ListaCriterios!F24","v":"Apoyo al empleo y emprendimiento"},{"$f":"ListaCriterios!G24","v":"SOCIAL"},{"$f":"ListaCriterios!H24","v":"1.3.1.h"},{"$f":"ListaCriterios!I24","v":"X"},{"$f":"ListaCriterios!J24","v":"¿Dispone la entidad de un programa de bolsa de empleo o similar para personas que buscan trabajo en el territorio?"},{"$f":"ListaCriterios!K24","v":"SI/NO"}]
[{"$f":"ListaCriterios!B25","v":"Aspectos sociales y comunicación"},{"$f":"ListaCriterios!C25","v":"1.3"},{"$f":"ListaCriterios!D25","v":"Empleo y formación"},{"$f":"ListaCriterios!E25","v":"1.3.1"},{"$f":"ListaCriterios!F25","v":"Apoyo al empleo y emprendimiento"},{"$f":"ListaCriterios!G25","v":"SOCIAL"},{"$f":"ListaCriterios!H25","v":"1.3.1.i"},{"$f":"ListaCriterios!I25","v":0},{"$f":"ListaCriterios!J25","v":"¿Existe formación en el territorio cercano adecuado a las necesidades de las empresas del PAE?"},{"$f":"ListaCriterios!K25","v":"SI/NO"}]
[]
[null,null,null,null,null,null,null,null,{"$f":"C49","v":"Promoción"}]
[]
[null,null,null,null,null,null,null,null,{"$f":"E49","v":"Comunicación, promoción y señalización"}]
[]
[{"$f":"ListaCriterios!B26","v":"Aspectos sociales y comunicación"},{"$f":"ListaCriterios!C26","v":"1.4"},{"$f":"ListaCriterios!D26","v":"Promoción"},{"$f":"ListaCriterios!E26","v":"1.4.1"},{"$f":"ListaCriterios!F26","v":"Comunicación, promoción y señalización"},{"$f":"ListaCriterios!G26","v":"SOCIAL"},{"$f":"ListaCriterios!H26","v":"1.4.1.a"},{"$f":"ListaCriterios!I26","v":0},{"$f":"ListaCriterios!J26","v":"¿El área empresarial tiene una imagen corporativa (logo) del área empresarial?"},{"$f":"ListaCriterios!K26","v":"SI/NO"}]
[{"$f":"ListaCriterios!B27","v":"Aspectos sociales y comunicación"},{"$f":"ListaCriterios!C27","v":"1.4"},{"$f":"ListaCriterios!D27","v":"Promoción"},{"$f":"ListaCriterios!E27","v":"1.4.1"},{"$f":"ListaCriterios!F27","v":"Comunicación, promoción y señalización"},{"$f":"ListaCriterios!G27","v":"SOCIAL"},{"$f":"ListaCriterios!H27","v":"1.4.1.b"},{"$f":"ListaCriterios!I27","v":0},{"$f":"ListaCriterios!J27","v":"Se realizan acciones periódicas de revisión y mejora de la estrategia de comunicación"},{"$f":"ListaCriterios!K27","v":"SI/NO"}]
[{"$f":"ListaCriterios!B28","v":"Aspectos sociales y comunicación"},{"$f":"ListaCriterios!C28","v":"1.4"},{"$f":"ListaCriterios!D28","v":"Promoción"},{"$f":"ListaCriterios!E28","v":"1.4.1"},{"$f":"ListaCriterios!F28","v":"Comunicación, promoción y señalización"},{"$f":"ListaCriterios!G28","v":"SOCIAL"},{"$f":"ListaCriterios!H28","v":"1.4.1.c"},{"$f":"ListaCriterios!I28","v":"X"},{"$f":"ListaCriterios!J28","v":"¿Se utiliza de forma clara y definida la imagen corporativa?"},{"$f":"ListaCriterios!K28","v":"SI/NO"}]
[{"$f":"ListaCriterios!B29","v":"Aspectos sociales y comunicación"},{"$f":"ListaCriterios!C29","v":"1.4"},{"$f":"ListaCriterios!D29","v":"Promoción"},{"$f":"ListaCriterios!E29","v":"1.4.1"},{"$f":"ListaCriterios!F29","v":"Comunicación, promoción y señalización"},{"$f":"ListaCriterios!G29","v":"SOCIAL"},{"$f":"ListaCriterios!H29","v":"1.4.1.d"},{"$f":"ListaCriterios!I29","v":"X"},{"$f":"ListaCriterios!J29","v":"¿La entidad cuenta con una estrategia o política de comunicación con objetivos claros, definidos y conocidos por sus integrantes?"},{"$f":"ListaCriterios!K29","v":"SI/NO"}]
[{"$f":"ListaCriterios!B30","v":"Aspectos sociales y comunicación"},{"$f":"ListaCriterios!C30","v":"1.4"},{"$f":"ListaCriterios!D30","v":"Promoción"},{"$f":"ListaCriterios!E30","v":"1.4.1"},{"$f":"ListaCriterios!F30","v":"Comunicación, promoción y señalización"},{"$f":"ListaCriterios!G30","v":"SOCIAL"},{"$f":"ListaCriterios!H30","v":"1.4.1.e"},{"$f":"ListaCriterios!I30","v":"X"},{"$f":"ListaCriterios!J30","v":"¿Se tiene una recopilación de impactos y presencia de polígono o de la entidad de gestión en los medios de comunicación?"},{"$f":"ListaCriterios!K30","v":"SI/NO"}]
[{"$f":"ListaCriterios!B31","v":"Aspectos sociales y comunicación"},{"$f":"ListaCriterios!C31","v":"1.4"},{"$f":"ListaCriterios!D31","v":"Promoción"},{"$f":"ListaCriterios!E31","v":"1.4.1"},{"$f":"ListaCriterios!F31","v":"Comunicación, promoción y señalización"},{"$f":"ListaCriterios!G31","v":"SOCIAL"},{"$f":"ListaCriterios!H31","v":"1.4.1.f"},{"$f":"ListaCriterios!I31","v":0},{"$f":"ListaCriterios!J31","v":"Grado de presencia en redes sociales"},{"$f":"ListaCriterios!K31","v":"Grad 1-5"}]
[{"$f":"ListaCriterios!B32","v":"Aspectos sociales y comunicación"},{"$f":"ListaCriterios!C32","v":"1.4"},{"$f":"ListaCriterios!D32","v":"Promoción"},{"$f":"ListaCriterios!E32","v":"1.4.1"},{"$f":"ListaCriterios!F32","v":"Comunicación, promoción y señalización"},{"$f":"ListaCriterios!G32","v":"SOCIAL"},{"$f":"ListaCriterios!H32","v":"1.4.1.g"},{"$f":"ListaCriterios!I32","v":"X"},{"$f":"ListaCriterios!J32","v":"¿Se han promovido / participado en jornadas, eventos o proyectos que fomenten la responsabilidad social (respecto medio ambiente, igualdad género, inserción laboral etc.)?"},{"$f":"ListaCriterios!K32","v":"SI/NO"}]

{"sheet":"2.GESTIÓN DE LOS RECURSOS","index":2,"n_rows":95,"n_cols":16,"rows_kept":95,"cut":false,"hidden":false,"merged":[[0,8,0,10]]}
[null,null,null,null,null,null,null,null,{"$f":"A7","v":"Gestión de los recursos"},null,null,"(Ocultar, és automatic)",null,null,"Sí","No"]
[]
[null,null,null,null,null,null,null,null,{"$f":"C7","v":"agua"}]
[]
[null,null,null,null,null,null,null,null,{"$f":"E7","v":"Eficiencia en el consumo de agua"}]
[]
[{"$f":"ListaCriterios!B33","v":"Gestión de los recursos"},{"$f":"ListaCriterios!C33","v":"2.1"},{"$f":"ListaCriterios!D33","v":"agua"},{"$f":"ListaCriterios!E33","v":"2.1.1"},{"$f":"ListaCriterios!F33","v":"Eficiencia en el consumo de agua"},{"$f":"ListaCriterios!G33","v":"AGUA"},{"$f":"ListaCriterios!H33","v":"2.1.1.a"},{"$f":"ListaCriterios!I33","v":"X"},{"$f":"ListaCriterios!J33","v":"¿Se dispone de herramientas por control y datos de consumo de agua (gestor hídrico)?"},{"$f":"ListaCriterios!K33","v":"SI/NO"},null,false,false]
[]
[null,null,null,null,null,null,null,null,{"$f":"E11","v":"Conocimiento sobre aguas residuales"}]
[]
[{"$f":"ListaCriterios!B34","v":"Gestión de los recursos"},{"$f":"ListaCriterios!C34","v":"2.1"},{"$f":"ListaCriterios!D34","v":"agua"},{"$f":"ListaCriterios!E34","v":"2.1.2"},{"$f":"ListaCriterios!F34","v":"Conocimiento sobre aguas residuales"},{"$f":"ListaCriterios!G34","v":"AGUA"},{"$f":"ListaCriterios!H34","v":"2.1.2.a"},{"$f":"ListaCriterios!I34","v":0},{"$f":"ListaCriterios!J34","v":"¿Se dispone de Información disponible sobre calidad y tipos de agua residual?"},{"$f":"ListaCriterios!K34","v":"SI/NO"}]
[]
[null,null,null,null,null,null,null,null,{"$f":"C23","v":"Energía y cambio climático"}]
[]
[]
[null,null,null,null,null,null,null,null,{"$f":"E18","v":"Gestión energética"}]
[]
[{"$f":"ListaCriterios!B35","v":"Gestión de los recursos"},{"$f":"ListaCriterios!C35","v":"2.2"},{"$f":"ListaCriterios!D35","v":"Energía y cambio climático"},{"$f":"ListaCriterios!E35","v":"2.2.1"},{"$f":"ListaCriterios!F35","v":"Gestión energética"},{"$f":"ListaCriterios!G35","v":"ENERGÍA Y CAMBIO CLIMATIC"},{"$f":"ListaCriterios!H35","v":"2.2.1.a"},{"$f":"ListaCriterios!I35","v":"X"},{"$f":"ListaCriterios!J35","v":"¿Se dispone de información sobre el consumo eléctrico?"},{"$f":"ListaCriterios!K35","v":"Grad 1-5"}]
[{"$f":"ListaCriterios!B36","v":"Gestión de los recursos"},{"$f":"ListaCriterios!C36","v":"2.2"},{"$f":"ListaCriterios!D36","v":"Energía y cambio climático"},{"$f":"ListaCriterios!E36","v":"2.2.1"},{"$f":"ListaCriterios!F36","v":"Gestión energética"},{"$f":"ListaCriterios!G36","v":"ENERGÍA Y CAMBIO CLIMATIC"},{"$f":"ListaCriterios!H36","v":"2.2.1.b"},{"$f":"ListaCriterios!I36","v":"X"},{"$f":"ListaCriterios!J36","v":"¿Se dispone de información sobre el consumo térmico?"},{"$f":"ListaCriterios!K36","v":"Grad 1-5"}]
[]
[null,null,null,null,null,null,null,null,{"$f":"E23","v":"Producción de energía renovable"}]
[]
[{"$f":"ListaCriterios!B37","v":"Gestión de los recursos"},{"$f":"ListaCriterios!C37","v":"2.2"},{"$f":"ListaCriterios!D37","v":"Energía y cambio climático"},{"$f":"ListaCriterios!E37","v":"2.2.2"},{"$f":"ListaCriterios!F37","v":"Producción de energía renovable"},{"$f":"ListaCriterios!G37","v":"ENERGÍA Y CAMBIO CLIMATIC"},{"$f":"ListaCriterios!H37","v":"2.2.2.a"},{"$f":"ListaCriterios!I37","v":"x"},{"$f":"ListaCriterios!J37","v":"¿Se dispone de información sobre la producción de energía renovable en las empresas?"},{"$f":"ListaCriterios!K37","v":"SI/NO"}]
[{"$f":"ListaCriterios!B38","v":"Gestión de los recursos"},{"$f":"ListaCriterios!C38","v":"2.2"},{"$f":"ListaCriterios!D38","v":"Energía y cambio climático"},{"$f":"ListaCriterios!E38","v":"2.2.2"},{"$f":"ListaCriterios!F38","v":"Producción de energía renovable"},{"$f":"ListaCriterios!G38","v":"ENERGÍA Y CAMBIO CLIMATIC"},{"$f":"ListaCriterios!H38","v":"2.2.2.b"},{"$f":"ListaCriterios!I38","v":"X"},{"$f":"ListaCriterios!J38","v":"¿Se dispone de espacio para la creación de infraestructuras para producción de e.renovable?"},{"$f":"ListaCriterios!K38","v":"SI/NO"}]
[{"$f":"ListaCriterios!B39","v":"Gestión de los recursos"},{"$f":"ListaCriterios!C39","v":"2.2"},{"$f":"ListaCriterios!D39","v":"Energía y cambio climático"},{"$f":"ListaCriterios!E39","v":"2.2.2"},{"$f":"ListaCriterios!F39","v":"Producción de energía renovable"},{"$f":"ListaCriterios!G39","v":"ENERGÍA Y CAMBIO CLIMATIC"},{"$f":"ListaCriterios!H39","v":"2.2.2.c"},{"$f":"ListaCriterios!I39","v":"x"},{"$f":"ListaCriterios!J39","v":"¿Existen infraestructuras de producción (planta biomasa, parque solar…)?"},{"$f":"ListaCriterios!K39","v":"SI/NO"}]
[]
[null,null,null,null,null,null,null,null,{"$f":"E29","v":"Autoproducción y generación compartida"}]
[]
[{"$f":"ListaCriterios!B40","v":"Gestión de los recursos"},{"$f":"ListaCriterios!C40","v":"2.2"},{"$f":"ListaCriterios!D40","v":"Energía y cambio climático"},{"$f":"ListaCriterios!E40","v":"2.2.3"},{"$f":"ListaCriterios!F40","v":"Autoproducción y generación compartida"},{"$f":"ListaCriterios!G40","v":"ENERGÍA Y CAMBIO CLIMATIC"},{"$f":"ListaCriterios!H40","v":"2.2.3.a"},{"$f":"ListaCriterios!I40","v":"x"},{"$f":"ListaCriterios!J40","v":"¿Existe alguna comunidad energética?"},{"$f":"ListaCriterios!K40","v":"Grad 1-5"}]
[]
[null,null,null,null,null,null,null,null,{"$f":"E33","v":"Potencial de producción e.solar/eolica"}]
[]
[{"$f":"ListaCriterios!B41","v":"Gestión de los recursos"},{"$f":"ListaCriterios!C41","v":"2.2"},{"$f":"ListaCriterios!D41","v":"Energía y cambio climático"},{"$f":"ListaCriterios!E41","v":"2.2.4"},{"$f":"ListaCriterios!F41","v":"Potencial de producción e.solar/eolica"},{"$f":"ListaCriterios!G41","v":"ENERGÍA Y CAMBIO CLIMATIC"},{"$f":"ListaCriterios!H41","v":"2.2.4.a"},{"$f":"ListaCriterios!I41","v":"x"},{"$f":"ListaCriterios!J41","v":"¿Se dispone de información sobre el potencial de producción solar?"},{"$f":"ListaCriterios!K41","v":"SI/NO"}]
[{"$f":"ListaCriterios!B42","v":"Gestión de los recursos"},{"$f":"ListaCriterios!C42","v":"2.2"},{"$f":"ListaCriterios!D42","v":"Energía y cambio climático"},{"$f":"ListaCriterios!E42","v":"2.2.4"},{"$f":"ListaCriterios!F42","v":"Potencial de producción e.solar/eolica"},{"$f":"ListaCriterios!G42","v":"ENERGÍA Y CAMBIO CLIMATIC"},{"$f":"ListaCriterios!H42","v":"2.2.4.b"},{"$f":"ListaCriterios!I42","v":"x"},{"$f":"ListaCriterios!J42","v":"¿Se dispone de información sobre el potencial de producción eólico? ¿Existen registros o estacion de medida viento?"},{"$f":"ListaCriterios!K42","v":"SI/NO"}]
[]
[null,null,null,null,null,null,null,null,{"$f":"E38","v":"Análisis de eficiencia energética para las empresas"}]
[]
[{"$f":"ListaCriterios!B43","v":"Gestión de los recursos"},{"$f":"ListaCriterios!C43","v":"2.2"},{"$f":"ListaCriterios!D43","v":"Energía y cambio climático"},{"$f":"ListaCriterios!E43","v":"2.2.5"},{"$f":"ListaCriterios!F43","v":"Análisis de eficiencia energética para las empresas"},{"$f":"ListaCriterios!G43","v":"ENERGÍA Y CAMBIO CLIMATIC"},{"$f":"ListaCriterios!H43","v":"2.2.5.a"},{"$f":"ListaCriterios!I43","v":"x"},{"$f":"ListaCriterios!J43","v":"¿Se han analizado medidas de eficiencia por las empresas, tales como termografías (aéreas oa pie) o asesoramientos personalidades?"},{"$f":"ListaCriterios!K43","v":"SI/NO"}]
[]
[null,null,null,null,null,null,null,null,{"$f":"E42","v":"Gases Efecto Invernadero"}]
[]
[{"$f":"ListaCriterios!B44","v":"Gestión de los recursos"},{"$f":"ListaCriterios!C44","v":"2.2"},{"$f":"ListaCriterios!D44","v":"Energía y cambio climático"},{"$f":"ListaCriterios!E44","v":"2.2.6"},{"$f":"ListaCriterios!F44","v":"Gases Efecto Invernadero"},{"$f":"ListaCriterios!G44","v":"ENERGÍA Y CAMBIO CLIMATIC"},{"$f":"ListaCriterios!H44","v":"2.2.6.a"},{"$f":"ListaCriterios!I44","v":"x"},{"$f":"ListaCriterios!J44","v":"Se tiene conocimiento de otras fuentes difusas de GEI (CFC's, COVs…)"},{"$f":"ListaCriterios!K44","v":"SI/NO"}]
[{"$f":"ListaCriterios!B45","v":"Gestión de los recursos"},{"$f":"ListaCriterios!C45","v":"2.2"},{"$f":"ListaCriterios!D45","v":"Energía y cambio climático"},{"$f":"ListaCriterios!E45","v":"2.2.6"},{"$f":"ListaCriterios!F45","v":"Gases Efecto Invernadero"},{"$f":"ListaCriterios!G45","v":"ENERGÍA Y CAMBIO CLIMATIC"},{"$f":"ListaCriterios!H45","v":"2.2.6.b"},{"$f":"ListaCriterios!I45","v":"x"},{"$f":"ListaCriterios!J45","v":"¿Se ofrece asistencia a las empresas para acogerse a algún sistema de comensación de emisiones?"},{"$f":"ListaCriterios!K45","v":"SI/NO"}]
[{"$f":"ListaCriterios!B46","v":"Gestión de los recursos"},{"$f":"ListaCriterios!C46","v":"2.2"},{"$f":"ListaCriterios!D46","v":"Energía y cambio climático"},{"$f":"ListaCriterios!E46","v":"2.2.6"},{"$f":"ListaCriterios!F46","v":"Gases Efecto Invernadero"},{"$f":"ListaCriterios!G46","v":"ENERGÍA Y CAMBIO CLIMATIC"},{"$f":"ListaCriterios!H46","v":"2.2.6.c"},{"$f":"ListaCriterios!I46","v":"x"},{"$f":"ListaCriterios!J46","v":"¿La gestión del polígono compensa sus emisiones?"},{"$f":"ListaCriterios!K46","v":"SI/NO"}]
[]
[null,null,null,null,null,null,null,null,{"$f":"C56","v":"Materia prima y producción"}]
[]
[]
[null,null,null,null,null,null,null,null,{"$f":"E51","v":"Matería local"}]
[]
[{"$f":"ListaCriterios!B47","v":"Gestión de los recursos"},{"$f":"ListaCriterios!C47","v":"2.3"},{"$f":"ListaCriterios!D47","v":"Materia prima y producción"},{"$f":"ListaCriterios!E47","v":"2.3.1"},{"$f":"ListaCriterios!F47","v":"Matería local"},{"$f":"ListaCriterios!G47","v":"MATERIALES"},{"$f":"ListaCriterios!H47","v":"2.3.1.a"},{"$f":"ListaCriterios!I47","v":"x"},{"$f":"ListaCriterios!J47","v":"Se dispone de información o estudios sobre los recursos materiales de entrada y salida (materias primas, producción…)"},{"$f":"ListaCriterios!K47","v":"SI/NO"}]
[]
[null,null,null,null,null,null,null,null,{"$f":"E55","v":"Tipología de actividad para optimizar recursos"}]
[]
[{"$f":"ListaCriterios!B48","v":"Gestión de los recursos"},{"$f":"ListaCriterios!C48","v":"2.3"},{"$f":"ListaCriterios!D48","v":"Materia prima y producción"},{"$f":"ListaCriterios!E48","v":"2.3.2"},{"$f":"ListaCriterios!F48","v":"Tipología de actividad para optimizar recursos"},{"$f":"ListaCriterios!G48","v":"MATERIALES"},{"$f":"ListaCriterios!H48","v":"2.3.2.a"},{"$f":"ListaCriterios!I48","v":0},{"$f":"ListaCriterios!J48","v":"¿Cuál es el grado de conocimiento de las actividades presentes?"},{"$f":"ListaCriterios!K48","v":"Grad 1-5"}]
[{"$f":"ListaCriterios!B49","v":"Gestión de los recursos"},{"$f":"ListaCriterios!C49","v":"2.3"},{"$f":"ListaCriterios!D49","v":"Materia prima y producción"},{"$f":"ListaCriterios!E49","v":"2.3.2"},{"$f":"ListaCriterios!F49","v":"Tipología de actividad para optimizar recursos"},{"$f":"ListaCriterios!G49","v":"MATERIALES"},{"$f":"ListaCriterios!H49","v":"2.3.2.b"},{"$f":"ListaCriterios!I49","v":"x"},{"$f":"ListaCriterios!J49","v":"¿Se ha realizado un análisis del ecosistema/metabolismo industrial?"},{"$f":"ListaCriterios!K49","v":"SI/NO"}]
[]
[null,null,null,null,null,null,null,null,{"$f":"C69","v":"Residuos"}]
[]
[]
[null,null,null,null,null,null,null,null,{"$f":"E63","v":"Generación de residuos"}]
[]
[{"$f":"ListaCriterios!B50","v":"Gestión de los recursos"},{"$f":"ListaCriterios!C50","v":"2.4"},{"$f":"ListaCriterios!D50","v":"Residuos"},{"$f":"ListaCriterios!E50","v":"2.4.1"},{"$f":"ListaCriterios!F50","v":"Generación de residuos"},{"$f":"ListaCriterios!G50","v":"RESIDUOS"},{"$f":"ListaCriterios!H50","v":"2.4.1.a"},{"$f":"ListaCriterios!I50","v":"x"},{"$f":"ListaCriterios!J50","v":"¿Se dispone de datos de generación de residuos global del PAE?"},{"$f":"ListaCriterios!K50","v":"SI/NO"}]
[{"$f":"ListaCriterios!B51","v":"Gestión de los recursos"},{"$f":"ListaCriterios!C51","v":"2.4"},{"$f":"ListaCriterios!D51","v":"Residuos"},{"$f":"ListaCriterios!E51","v":"2.4.1"},{"$f":"ListaCriterios!F51","v":"Generación de residuos"},{"$f":"ListaCriterios!G51","v":"RESIDUOS"},{"$f":"ListaCriterios!H51","v":"2.4.1.b"},{"$f":"ListaCriterios!I51","v":"x"},{"$f":"ListaCriterios!J51","v":"¿Existe algún tipo de política, estrategia o se han realizado actividades dentro del concepto Zero-Waste?"},{"$f":"ListaCriterios!K51","v":"Grad 1-5"}]
[{"$f":"ListaCriterios!B55","v":"Gestión de los recursos"},{"$f":"ListaCriterios!C55","v":"2.4"},{"$f":"ListaCriterios!D55","v":"Residuos"},{"$f":"ListaCriterios!E55","v":"2.4.3"},{"$f":"ListaCriterios!F55","v":"Generación de residuos"},{"$f":"ListaCriterios!G55","v":"RESIDUOS"},{"$f":"ListaCriterios!H55","v":"2.4.3.a"},{"$f":"ListaCriterios!I55","v":0},{"$f":"ListaCriterios!J55","v":"¿Se han elaborado materiales para la difusión y concienciación en materia de gestión de residuos (reducción, reutilización y reciclaje)?"},{"$f":"ListaCriterios!K55","v":"SI/NO"}]
[]
[null,null,null,null,null,null,null,null,{"$f":"E69","v":"Valorización de residuos"}]
[]
[{"$f":"ListaCriterios!B52","v":"Gestión de los recursos"},{"$f":"ListaCriterios!C52","v":"2.4"},{"$f":"ListaCriterios!D52","v":"Residuos"},{"$f":"ListaCriterios!E52","v":"2.4.2"},{"$f":"ListaCriterios!F52","v":"Valorización de residuos"},{"$f":"ListaCriterios!G52","v":"RESIDUOS"},{"$f":"ListaCriterios!H52","v":"2.4.2.a"},{"$f":"ListaCriterios!I52","v":"x"},{"$f":"ListaCriterios!J52","v":"¿Existen políticas de gestión y/o valorización compartida de residuos?"},{"$f":"ListaCriterios!K52","v":"SI/NO"}]
[{"$f":"ListaCriterios!B53","v":"Gestión de los recursos"},{"$f":"ListaCriterios!C53","v":"2.4"},{"$f":"ListaCriterios!D53","v":"Residuos"},{"$f":"ListaCriterios!E53","v":"2.4.2"},{"$f":"ListaCriterios!F53","v":"Valorización de residuos"},{"$f":"ListaCriterios!G53","v":"RESIDUOS"},{"$f":"ListaCriterios!H53","v":"2.4.2.b"},{"$f":"ListaCriterios!I53","v":0},{"$f":"ListaCriterios!J53","v":"¿Existen valorizadores de residuos en el propio PAE?"},{"$f":"ListaCriterios!K53","v":"SI/NO"}]
[{"$f":"ListaCriterios!B54","v":"Gestión de los recursos"},{"$f":"ListaCriterios!C54","v":"2.4"},{"$f":"ListaCriterios!D54","v":"Residuos"},{"$f":"ListaCriterios!E54","v":"2.4.2"},{"$f":"ListaCriterios!F54","v":"Valorización de residuos"},{"$f":"ListaCriterios!G54","v":"RESIDUOS"},{"$f":"ListaCriterios!H54","v":"2.4.2.c"},{"$f":"ListaCriterios!I54","v":"x"},{"$f":"ListaCriterios!J54","v":"¿Se dispone de espacios reservados o disponibles por infraestructuras de la gestión de residuos individual o compartida?"},{"$f":"ListaCriterios!K54","v":"SI/NO"}]
[]
[null,null,null,null,null,null,null,null,{"$f":"E75","v":"Recogida de residuos"}]
[]
[{"$f":"ListaCriterios!B56","v":"Gestión de los recursos"},{"$f":"ListaCriterios!C56","v":"2.4"},{"$f":"ListaCriterios!D56","v":"Residuos"},{"$f":"ListaCriterios!E56","v":"2.4.4"},{"$f":"ListaCriterios!F56","v":"Recogida de residuos"},{"$f":"ListaCriterios!G56","v":"RESIDUOS"},{"$f":"ListaCriterios!H56","v":"2.4.4.a"},{"$f":"ListaCriterios!I56","v":0},{"$f":"ListaCriterios!J56","v":"(En caso de corresponder la gestión en el área empresarial): ¿Se encuentran disponibles los documentos legales asociados a la gestión de residuos (transportista/gestor)?"},{"$f":"ListaCriterios!K56","v":"SI/NO"}]
[{"$f":"ListaCriterios!B57","v":"Gestión de los recursos"},{"$f":"ListaCriterios!C57","v":"2.4"},{"$f":"ListaCriterios!D57","v":"Residuos"},{"$f":"ListaCriterios!E57","v":"2.4.4"},{"$f":"ListaCriterios!F57","v":"Recogida de residuos"},{"$f":"ListaCriterios!G57","v":"RESIDUOS"},{"$f":"ListaCriterios!H57","v":"2.4.4.b"},{"$f":"ListaCriterios!I57","v":0},{"$f":"ListaCriterios!J57","v":"(En caso de corresponder la gestión en el área) : ¿Se dispone de los contratos con la empresa proveedora del servicio de gestión de residuos?"},{"$f":"ListaCriterios!K57","v":"SI/NO"}]
[{"$f":"ListaCriterios!B58","v":"Gestión de los recursos"},{"$f":"ListaCriterios!C58","v":"2.4"},{"$f":"ListaCriterios!D58","v":"Residuos"},{"$f":"ListaCriterios!E58","v":"2.4.4"},{"$f":"ListaCriterios!F58","v":"Recogida de residuos"},{"$f":"ListaCriterios!G58","v":"RESIDUOS"},{"$f":"ListaCriterios!H58","v":"2.4.4.c"},{"$f":"ListaCriterios!I58","v":0},{"$f":"ListaCriterios!J58","v":"Existen papeleras en número y estado de conservación adecuado a las necesidades del PAE"},{"$f":"ListaCriterios!K58","v":"Grad 1-5"}]
[{"$f":"ListaCriterios!B59","v":"Gestión de los recursos"},{"$f":"ListaCriterios!C59","v":"2.4"},{"$f":"ListaCriterios!D59","v":"Residuos"},{"$f":"ListaCriterios!E59","v":"2.4.4"},{"$f":"ListaCriterios!F59","v":"Recogida de residuos"},{"$f":"ListaCriterios!G59","v":"RESIDUOS"},{"$f":"ListaCriterios!H59","v":"2.4.4.d"},{"$f":"ListaCriterios!I59","v":0},{"$f":"ListaCriterios!J59","v":"¿Existen contenedores de recogida municipal en la vía pública? (negativo)"},{"$f":"ListaCriterios!K59","v":"SI/NO"}]
[]
[null,null,null,null,null,null,null,null,{"$f":"C90","v":"Simbiosis industrial"}]
[]
[]
[null,null,null,null,null,null,null,null,{"$f":"E85","v":"Especialización productiva en los PAE"}]
[]
[{"$f":"ListaCriterios!B60","v":"Gestión de los recursos"},{"$f":"ListaCriterios!C60","v":"2.5"},{"$f":"ListaCriterios!D60","v":"Simbiosis industrial"},{"$f":"ListaCriterios!E60","v":"2.5.1"},{"$f":"ListaCriterios!F60","v":"Especialización productiva en los PAE"},{"$f":"ListaCriterios!G60","v":"MATERIALES"},{"$f":"ListaCriterios!H60","v":"2.5.1.a"},{"$f":"ListaCriterios!I60","v":"x"},{"$f":"ListaCriterios!J60","v":"¿Existen políticas para la implantación/promoción según tipos de actividades/especialización?"},{"$f":"ListaCriterios!K60","v":"SI/NO"}]
[]
[null,null,null,null,null,null,null,null,{"$f":"E89","v":"Potencialidad de simbiosis industrial"}]
[]
[{"$f":"ListaCriterios!B61","v":"Gestión de los recursos"},{"$f":"ListaCriterios!C61","v":"2.5"},{"$f":"ListaCriterios!D61","v":"Simbiosis industrial"},{"$f":"ListaCriterios!E61","v":"2.5.2"},{"$f":"ListaCriterios!F61","v":"Potencialidad de simbiosis industrial"},{"$f":"ListaCriterios!G61","v":"MATERIALES"},{"$f":"ListaCriterios!H61","v":"2.5.2.a"},{"$f":"ListaCriterios!I61","v":"x"},{"$f":"ListaCriterios!J61","v":"¿Existe algún servicio de simbiosis industrial o equivalente?"},{"$f":"ListaCriterios!K61","v":"Grad 1-5"}]
[{"$f":"ListaCriterios!B62","v":"Gestión de los recursos"},{"$f":"ListaCriterios!C62","v":"2.5"},{"$f":"ListaCriterios!D62","v":"Simbiosis industrial"},{"$f":"ListaCriterios!E62","v":"2.5.2"},{"$f":"ListaCriterios!F62","v":"Potencialidad de simbiosis industrial"},{"$f":"ListaCriterios!G62","v":"MATERIALES"},{"$f":"ListaCriterios!H62","v":"2.5.2.b"},{"$f":"ListaCriterios!I62","v":"x"},{"$f":"ListaCriterios!J62","v":"¿Se ha realizado algún estudio del potencial de simbiosis industrial en el PAE o en su territorio?"},{"$f":"ListaCriterios!K62","v":"SI/NO"}]
[]
[null,null,null,null,null,null,null,null,{"$f":"E94","v":"Reaprovechamiento de recurso-residuo"}]
[]
[{"$f":"ListaCriterios!B63","v":"Gestión de los recursos"},{"$f":"ListaCriterios!C63","v":"2.5"},{"$f":"ListaCriterios!D63","v":"Simbiosis industrial"},{"$f":"ListaCriterios!E63","v":"2.5.3"},{"$f":"ListaCriterios!F63","v":"Reaprovechamiento de recurso-residuo"},{"$f":"ListaCriterios!G63","v":"RESIDUOS"},{"$f":"ListaCriterios!H63","v":"2.5.3.a"},{"$f":"ListaCriterios!I63","v":"x"},{"$f":"ListaCriterios!J63","v":"¿Se realizan acciones técnicas o divulgativas que fomenten la recuperación de recursos y residuos en el PAE?"},{"$f":"ListaCriterios!K63","v":"SI/NO"}]
[{"$f":"ListaCriterios!B64","v":"Gestión de los recursos"},{"$f":"ListaCriterios!C64","v":"2.5"},{"$f":"ListaCriterios!D64","v":"Simbiosis industrial"},{"$f":"ListaCriterios!E64","v":"2.5.3"},{"$f":"ListaCriterios!F64","v":"Reaprovechamiento de recurso-residuo"},{"$f":"ListaCriterios!G64","v":"RESIDUOS"},{"$f":"ListaCriterios!H64","v":"2.5.3.b"},{"$f":"ListaCriterios!I64","v":"x"},{"$f":"ListaCriterios!J64","v":"¿Se conoce la cantidad de residuos que se recuperan en el propio PAE?"},{"$f":"ListaCriterios!K64","v":"SI/NO"}]

{"sheet":"3.INFRASTRUCTURAS Y SERVICIOS","index":3,"n_rows":220,"n_cols":16,"rows_kept":220,"cut":false,"hidden":false,"merged":[[0,8,0,10]]}
[null,null,null,null,null,null,null,null,{"$f":"A7","v":"Infrastructuras y servicios"},null,null,"(Ocultar, és automatic)",null,null,"Sí","No"]
[]
[null,null,null,null,null,null,null,null,{"$f":"C7","v":"Infrastructuras avanzadas"}]
[]
[null,null,null,null,null,null,null,null,{"$f":"E7","v":"Red separativa de aguas (pluviales, grises)"}]
[]
[{"$f":"ListaCriterios!B65","v":"Infrastructuras y servicios"},{"$f":"ListaCriterios!C65","v":"3.1"},{"$f":"ListaCriterios!D65","v":"Infrastructuras avanzadas"},{"$f":"ListaCriterios!E65","v":"3.1.1"},{"$f":"ListaCriterios!F65","v":"Red separativa de aguas (pluviales, grises)"},{"$f":"ListaCriterios!G65","v":"AGUA"},{"$f":"ListaCriterios!H65","v":"3.1.1.a"},{"$f":"ListaCriterios!I65","v":"x"},{"$f":"ListaCriterios!J65","v":"¿Existe red de separativa de aguas pluviales?"},{"$f":"ListaCriterios!K65","v":"Grad 1-5"},null,false,false]
[{"$f":"ListaCriterios!B66","v":"Infrastructuras y servicios"},{"$f":"ListaCriterios!C66","v":"3.1"},{"$f":"ListaCriterios!D66","v":"Infrastructuras avanzadas"},{"$f":"ListaCriterios!E66","v":"3.1.1"},{"$f":"ListaCriterios!F66","v":"Red separativa de aguas (pluviales, grises)"},{"$f":"ListaCriterios!G66","v":"AGUA"},{"$f":"ListaCriterios!H66","v":"3.1.1.b"},{"$f":"ListaCriterios!I66","v":"x"},{"$f":"ListaCriterios!J66","v":"¿Existe red de separativa de aguas grises?"},{"$f":"ListaCriterios!K66","v":"Grad 1-5"}]
[{"$f":"ListaCriterios!B67","v":"Infrastructuras y servicios"},{"$f":"ListaCriterios!C67","v":"3.1"},{"$f":"ListaCriterios!D67","v":"Infrastructuras avanzadas"},{"$f":"ListaCriterios!E67","v":"3.1.1"},{"$f":"ListaCriterios!F67","v":"Red separativa de aguas (pluviales, grises)"},{"$f":"ListaCriterios!G67","v":"AGUA"},{"$f":"ListaCriterios!H67","v":"3.1.1.c"},{"$f":"ListaCriterios!I67","v":"x"},{"$f":"ListaCriterios!J67","v":"¿Se dispone de algún sistema de recogida para el aprovechamiento de aguas pluviales?"},{"$f":"ListaCriterios!K67","v":"SI/NO"}]
[]
[null,null,null,null,null,null,null,null,{"$f":"E13","v":"Infraestructuras avanzadas para la economía circular"}]
[]
[{"$f":"ListaCriterios!B68","v":"Infrastructuras y servicios"},{"$f":"ListaCriterios!C68","v":"3.1"},{"$f":"ListaCriterios!D68","v":"Infrastructuras avanzadas"},{"$f":"ListaCriterios!E68","v":"3.1.2"},{"$f":"ListaCriterios!F68","v":"Infraestructuras avanzadas para la economía circular"},{"$f":"ListaCriterios!G68","v":"COLABORACIÓN"},{"$f":"ListaCriterios!H68","v":"3.1.2.a"},{"$f":"ListaCriterios!I68","v":"x"},{"$f":"ListaCriterios!J68","v":"¿Se ha realizado algún estudio de necesidades/oportunidades de infraestructuras avanzadas (p.ej. biorefinería, planta biogas)?"},{"$f":"ListaCriterios!K68","v":"SI/NO"}]
[{"$f":"ListaCriterios!B69","v":"Infrastructuras y servicios"},{"$f":"ListaCriterios!C69","v":"3.1"},{"$f":"ListaCriterios!D69","v":"Infrastructuras avanzadas"},{"$f":"ListaCriterios!E69","v":"3.1.2"},{"$f":"ListaCriterios!F69","v":"Infraestructuras avanzadas para la economía circular"},{"$f":"ListaCriterios!G69","v":"COLABORACIÓN"},{"$f":"ListaCriterios!H69","v":"3.1.2.b"},{"$f":"ListaCriterios!I69","v":"x"},{"$f":"ListaCriterios!J69","v":"¿Existe alguna infraestructura del tipo: biorefinería, planta biogas, banco de ensayos de materiales, EDAR específica por tipos de aguas, …?"},{"$f":"ListaCriterios!K69","v":"Grad 0-5"}]
[]
[null,null,null,null,null,null,null,null,{"$f":"E18","v":"Energía compartida (calor, electricidad)"}]
[]
[{"$f":"ListaCriterios!B70","v":"Infrastructuras y servicios"},{"$f":"ListaCriterios!C70","v":"3.1"},{"$f":"ListaCriterios!D70","v":"Infrastructuras avanzadas"},{"$f":"ListaCriterios!E70","v":"3.1.3"},{"$f":"ListaCriterios!F70","v":"Energía compartida (calor, electricidad)"},{"$f":"ListaCriterios!G70","v":"ENERGÍA Y CAMBIO CLIMATIC"},{"$f":"ListaCriterios!H70","v":"3.1.3.a"},{"$f":"ListaCriterios!I70","v":"x"},{"$f":"ListaCriterios!J70","v":"¿Existe alguna central de producción de energía renovable gestionada por el PAE?"},{"$f":"ListaCriterios!K70","v":"SI/NO"}]
[{"$f":"ListaCriterios!B71","v":"Infrastructuras y servicios"},{"$f":"ListaCriterios!C71","v":"3.1"},{"$f":"ListaCriterios!D71","v":"Infrastructuras avanzadas"},{"$f":"ListaCriterios!E71","v":"3.1.3"},{"$f":"ListaCriterios!F71","v":"Energía compartida (calor, electricidad)"},{"$f":"ListaCriterios!G71","v":"ENERGÍA Y CAMBIO CLIMATIC"},{"$f":"ListaCriterios!H71","v":"3.1.3.b"},{"$f":"ListaCriterios!I71","v":"x"},{"$f":"ListaCriterios!J71","v":"Existe alguna infraestructura relacionada con la acumulación de energía (baterías), y/o smart grids"},{"$f":"ListaCriterios!K71","v":"SI/NO"}]
[]
[null,null,null,null,null,null,null,null,{"$f":"E23","v":"Redes de calor y frío"}]
[]
[{"$f":"ListaCriterios!B72","v":"Infrastructuras y servicios"},{"$f":"ListaCriterios!C72","v":"3.1"},{"$f":"ListaCriterios!D72","v":"Infrastructuras avanzadas"},{"$f":"ListaCriterios!E72","v":"3.1.4"},{"$f":"ListaCriterios!F72","v":"Redes de calor y frío"},{"$f":"ListaCriterios!G72","v":"ENERGÍA Y CAMBIO CLIMATIC"},{"$f":"ListaCriterios!H72","v":"3.1.4.a"},{"$f":"ListaCriterios!I72","v":"x"},{"$f":"ListaCriterios!J72","v":"¿Existe red de distribución de calor?"},{"$f":"ListaCriterios!K72","v":"SI/NO"}]
[{"$f":"ListaCriterios!B73","v":"Infrastructuras y servicios"},{"$f":"ListaCriterios!C73","v":"3.1"},{"$f":"ListaCriterios!D73","v":"Infrastructuras avanzadas"},{"$f":"ListaCriterios!E73","v":"3.1.4"},{"$f":"ListaCriterios!F73","v":"Redes de calor y frío"},{"$f":"ListaCriterios!G73","v":"ENERGÍA Y CAMBIO CLIMATIC"},{"$f":"ListaCriterios!H73","v":"3.1.4.b"},{"$f":"ListaCriterios!I73","v":"x"},{"$f":"ListaCriterios!J73","v":"¿Existe red de distribución de frío?"},{"$f":"ListaCriterios!K73","v":"SI/NO"}]
[{"$f":"ListaCriterios!B74","v":"Infrastructuras y servicios"},{"$f":"ListaCriterios!C74","v":"3.1"},{"$f":"ListaCriterios!D74","v":"Infrastructuras avanzadas"},{"$f":"ListaCriterios!E74","v":"3.1.4"},{"$f":"ListaCriterios!F74","v":"Redes de calor y frío"},{"$f":"ListaCriterios!G74","v":"ENERGÍA Y CAMBIO CLIMATIC"},{"$f":"ListaCriterios!H74","v":"3.1.4.c"},{"$f":"ListaCriterios!I74","v":"x"},{"$f":"ListaCriterios!J74","v":"Si no hay redes, ¿hay previsión de espacio en zanjas para extenderla?"},{"$f":"ListaCriterios!K74","v":"SI/NO"}]
[{"$f":"ListaCriterios!B75","v":"Infrastructuras y servicios"},{"$f":"ListaCriterios!C75","v":"3.1"},{"$f":"ListaCriterios!D75","v":"Infrastructuras avanzadas"},{"$f":"ListaCriterios!E75","v":"3.1.4"},{"$f":"ListaCriterios!F75","v":"Redes de calor y frío"},{"$f":"ListaCriterios!G75","v":"ENERGÍA Y CAMBIO CLIMATIC"},{"$f":"ListaCriterios!H75","v":"3.1.4.d"},{"$f":"ListaCriterios!I75","v":"x"},{"$f":"ListaCriterios!J75","v":"¿Se ha estudiado la viabilidad de una red de calor/frío?"},{"$f":"ListaCriterios!K75","v":"SI/NO"}]
[]
[null,null,null,null,null,null,null,null,{"$f":"E30","v":"Recarga VE"}]
[]
[{"$f":"ListaCriterios!B76","v":"Infrastructuras y servicios"},{"$f":"ListaCriterios!C76","v":"3.1"},{"$f":"ListaCriterios!D76","v":"Infrastructuras avanzadas"},{"$f":"ListaCriterios!E76","v":"3.1.5"},{"$f":"ListaCriterios!F76","v":"Recarga VE"},{"$f":"ListaCriterios!G76","v":"MOVILIDAD"},{"$f":"ListaCriterios!H76","v":"3.1.5.a"},{"$f":"ListaCriterios!I76","v":"x"},{"$f":"ListaCriterios!J76","v":"Concentración (num/1000 trabajadores) de puntos de recarga por vehículos eléctricos accesibles a trabajadores y visitantes"},{"$f":"ListaCriterios!K76","v":"Grad 1-5"}]
[{"$f":"ListaCriterios!B77","v":"Infrastructuras y servicios"},{"$f":"ListaCriterios!C77","v":"3.1"},{"$f":"ListaCriterios!D77","v":"Infrastructuras avanzadas"},{"$f":"ListaCriterios!E77","v":"3.1.5"},{"$f":"ListaCriterios!F77","v":"Recarga VE"},{"$f":"ListaCriterios!G77","v":"MOVILIDAD"},{"$f":"ListaCriterios!H77","v":"3.1.5.a"},{"$f":"ListaCriterios!I77","v":"x"},{"$f":"ListaCriterios!J77","v":"¿Existe alguna fotolinera en el PAE?"},{"$f":"ListaCriterios!K77","v":"SI/NO"}]
[]
[null,null,null,null,null,null,null,null,{"$f":"C40","v":"Infrastructuras básicas"}]
[]
[null,null,null,null,null,null,null,null,{"$f":"E37","v":"Abastecimiento de agua"}]
[]
[{"$f":"ListaCriterios!B78","v":"Infrastructuras y servicios"},{"$f":"ListaCriterios!C78","v":"3.2"},{"$f":"ListaCriterios!D78","v":"Infrastructuras básicas"},{"$f":"ListaCriterios!E78","v":"3.2.1"},{"$f":"ListaCriterios!F78","v":"Abastecimiento de agua"},{"$f":"ListaCriterios!G78","v":"AGUA"},{"$f":"ListaCriterios!H78","v":"3.2.01.a"},{"$f":"ListaCriterios!I78","v":"x"},{"$f":"ListaCriterios!J78","v":"¿Se ha realizado un estudio de detección de fugas en el sistema de distribución de agua?"},{"$f":"ListaCriterios!K78","v":"SI/NO"}]
[{"$f":"ListaCriterios!B79","v":"Infrastructuras y servicios"},{"$f":"ListaCriterios!C79","v":"3.2"},{"$f":"ListaCriterios!D79","v":"Infrastructuras básicas"},{"$f":"ListaCriterios!E79","v":"3.2.1"},{"$f":"ListaCriterios!F79","v":"Abastecimiento de agua"},{"$f":"ListaCriterios!G79","v":"AGUA"},{"$f":"ListaCriterios!H79","v":"3.2.01.b"},{"$f":"ListaCriterios!I79","v":0},{"$f":"ListaCriterios!J79","v":"¿Se dispone de información sobre la relación Agua facturada/Agua consumida?"},{"$f":"ListaCriterios!K79","v":"SI/NO"}]
[{"$f":"ListaCriterios!B80","v":"Infrastructuras y servicios"},{"$f":"ListaCriterios!C80","v":"3.2"},{"$f":"ListaCriterios!D80","v":"Infrastructuras básicas"},{"$f":"ListaCriterios!E80","v":"3.2.1"},{"$f":"ListaCriterios!F80","v":"Abastecimiento de agua"},{"$f":"ListaCriterios!G80","v":"AGUA"},{"$f":"ListaCriterios!H80","v":"3.2.01.c"},{"$f":"ListaCriterios!I80","v":0},{"$f":"ListaCriterios!J80","v":"En caso de disponer de información, ¿cuál es la eficiencia de la red de distribución (%)?"},{"$f":"ListaCriterios!K80","v":"Grad 1-5"}]
[{"$f":"ListaCriterios!B81","v":"Infrastructuras y servicios"},{"$f":"ListaCriterios!C81","v":"3.2"},{"$f":"ListaCriterios!D81","v":"Infrastructuras básicas"},{"$f":"ListaCriterios!E81","v":"3.2.1"},{"$f":"ListaCriterios!F81","v":"Abastecimiento de agua"},{"$f":"ListaCriterios!G81","v":"AGUA"},{"$f":"ListaCriterios!H81","v":"3.2.01.d"},{"$f":"ListaCriterios!I81","v":0},{"$f":"ListaCriterios!J81","v":"¿Cuál es la disponibilidad de agua de pozos y/o aguas pluviales (cualitativo)?"},{"$f":"ListaCriterios!K81","v":"Grad 1-5"}]
[{"$f":"ListaCriterios!B82","v":"Infrastructuras y servicios"},{"$f":"ListaCriterios!C82","v":"3.2"},{"$f":"ListaCriterios!D82","v":"Infrastructuras básicas"},{"$f":"ListaCriterios!E82","v":"3.2.1"},{"$f":"ListaCriterios!F82","v":"Abastecimiento de agua"},{"$f":"ListaCriterios!G82","v":"AGUA"},{"$f":"ListaCriterios!H82","v":"3.2.01.h"},{"$f":"ListaCriterios!I82","v":0},{"$f":"ListaCriterios!J82","v":"(En caso de existir depósitos para abastecimiento) El acceso a los depósitos se restringe a las personas autorizadas"},{"$f":"ListaCriterios!K82","v":"SI/NO"}]
[{"$f":"ListaCriterios!B83","v":"Infrastructuras y servicios"},{"$f":"ListaCriterios!C83","v":"3.2"},{"$f":"ListaCriterios!D83","v":"Infrastructuras básicas"},{"$f":"ListaCriterios!E83","v":"3.2.1"},{"$f":"ListaCriterios!F83","v":"Abastecimiento de agua"},{"$f":"ListaCriterios!G83","v":"AGUA"},{"$f":"ListaCriterios!H83","v":"3.2.01.i"},{"$f":"ListaCriterios!I83","v":0},{"$f":"ListaCriterios!J83","v":"(En caso de existir depósitos para abastecimiento) Los depósitos se encuentran bien conservados y limpios"},{"$f":"ListaCriterios!K83","v":"SI/NO"}]
[{"$f":"ListaCriterios!B84","v":"Infrastructuras y servicios"},{"$f":"ListaCriterios!C84","v":"3.2"},{"$f":"ListaCriterios!D84","v":"Infrastructuras básicas"},{"$f":"ListaCriterios!E84","v":"3.2.1"},{"$f":"ListaCriterios!F84","v":"Abastecimiento de agua"},{"$f":"ListaCriterios!G84","v":"AGUA"},{"$f":"ListaCriterios!H84","v":"3.2.01.j"},{"$f":"ListaCriterios!I84","v":0},{"$f":"ListaCriterios!J84","v":"¿Se dispone de planos de la red de abastecimiento de agua?"},{"$f":"ListaCriterios!K84","v":"SI/NO"}]
[{"$f":"ListaCriterios!B85","v":"Infrastructuras y servicios"},{"$f":"ListaCriterios!C85","v":"3.2"},{"$f":"ListaCriterios!D85","v":"Infrastructuras básicas"},{"$f":"ListaCriterios!E85","v":"3.2.1"},{"$f":"ListaCriterios!F85","v":"Abastecimiento de agua"},{"$f":"ListaCriterios!G85","v":"AGUA"},{"$f":"ListaCriterios!H85","v":"3.2.01.k"},{"$f":"ListaCriterios!I85","v":0},{"$f":"ListaCriterios!J85","v":"Se dispone del contrato de prestación de servicio de abastecimiento de agua (por ejemplo, adjudicación pública del servicio)"},{"$f":"ListaCriterios!K85","v":"SI/NO"}]
[{"$f":"ListaCriterios!B86","v":"Infrastructuras y servicios"},{"$f":"ListaCriterios!C86","v":"3.2"},{"$f":"ListaCriterios!D86","v":"Infrastructuras básicas"},{"$f":"ListaCriterios!E86","v":"3.2.1"},{"$f":"ListaCriterios!F86","v":"Abastecimiento de agua"},{"$f":"ListaCriterios!G86","v":"AGUA"},{"$f":"ListaCriterios!H86","v":"3.2.01.l"},{"$f":"ListaCriterios!I86","v":0},{"$f":"ListaCriterios!J86","v":"¿Se tienen disponibles analíticas periódicas sobre la potabilidad del agua de consumo?"},{"$f":"ListaCriterios!K86","v":"SI/NO"}]
[{"$f":"ListaCriterios!B87","v":"Infrastructuras y servicios"},{"$f":"ListaCriterios!C87","v":"3.2"},{"$f":"ListaCriterios!D87","v":"Infrastructuras básicas"},{"$f":"ListaCriterios!E87","v":"3.2.1"},{"$f":"ListaCriterios!F87","v":"Abastecimiento de agua"},{"$f":"ListaCriterios!G87","v":"AGUA"},{"$f":"ListaCriterios!H87","v":"3.2.01.m"},{"$f":"ListaCriterios!I87","v":0},{"$f":"ListaCriterios!J87","v":"¿Se dispone de documentos oficiales que reflejan las principales características de la red de abastecimiento de agua (por ejemplo pliego condiciones técnicas de prestación de servicio)?"},{"$f":"ListaCriterios!K87","v":"SI/NO"}]
[{"$f":"ListaCriterios!B88","v":"Infrastructuras y servicios"},{"$f":"ListaCriterios!C88","v":"3.2"},{"$f":"ListaCriterios!D88","v":"Infrastructuras básicas"},{"$f":"ListaCriterios!E88","v":"3.2.1"},{"$f":"ListaCriterios!F88","v":"Abastecimiento de agua"},{"$f":"ListaCriterios!G88","v":"AGUA"},{"$f":"ListaCriterios!H88","v":"3.2.01.n"},{"$f":"ListaCriterios!I88","v":0},{"$f":"ListaCriterios!J88","v":"¿El caudal de la red de abastecimiento es adecuado a las necesidades del área?"},{"$f":"ListaCriterios!K88","v":"SI/NO"}]
[{"$f":"ListaCriterios!B89","v":"Infrastructuras y servicios"},{"$f":"ListaCriterios!C89","v":"3.2"},{"$f":"ListaCriterios!D89","v":"Infrastructuras básicas"},{"$f":"ListaCriterios!E89","v":"3.2.1"},{"$f":"ListaCriterios!F89","v":"Abastecimiento de agua"},{"$f":"ListaCriterios!G89","v":"AGUA"},{"$f":"ListaCriterios!H89","v":"3.2.01.o"},{"$f":"ListaCriterios!I89","v":0},{"$f":"ListaCriterios!J89","v":"En caso de competencia exclusiva del área, ¿los materiales empleados son los adecuados y se cumple la legislación vigente?"},{"$f":"ListaCriterios!K89","v":"Grad 1-5"}]
[{"$f":"ListaCriterios!B90","v":"Infrastructuras y servicios"},{"$f":"ListaCriterios!C90","v":"3.2"},{"$f":"ListaCriterios!D90","v":"Infrastructuras básicas"},{"$f":"ListaCriterios!E90","v":"3.2.1"},{"$f":"ListaCriterios!F90","v":"Abastecimiento de agua"},{"$f":"ListaCriterios!G90","v":"AGUA"},{"$f":"ListaCriterios!H90","v":"3.2.01.p"},{"$f":"ListaCriterios!I90","v":0},{"$f":"ListaCriterios!J90","v":"¿La red de abastecimiento de agua es adecuada al tipo de área empresarial?"},{"$f":"ListaCriterios!K90","v":"SI/NO"}]
[{"$f":"ListaCriterios!B91","v":"Infrastructuras y servicios"},{"$f":"ListaCriterios!C91","v":"3.2"},{"$f":"ListaCriterios!D91","v":"Infrastructuras básicas"},{"$f":"ListaCriterios!E91","v":"3.2.1"},{"$f":"ListaCriterios!F91","v":"Abastecimiento de agua"},{"$f":"ListaCriterios!G91","v":"AGUA"},{"$f":"ListaCriterios!H91","v":"3.2.01.q"},{"$f":"ListaCriterios!I91","v":0},{"$f":"ListaCriterios!J91","v":"¿La red de abastecimiento está completamente en servicio?"},{"$f":"ListaCriterios!K91","v":"SI/NO"}]
[]
[null,null,null,null,null,null,null,null,{"$f":"E54","v":"Saneamiento de agua"}]
[]
[{"$f":"ListaCriterios!B92","v":"Infrastructuras y servicios"},{"$f":"ListaCriterios!C92","v":"3.2"},{"$f":"ListaCriterios!D92","v":"Infrastructuras básicas"},{"$f":"ListaCriterios!E92","v":"3.2.2"},{"$f":"ListaCriterios!F92","v":"Saneamiento de agua"},{"$f":"ListaCriterios!G92","v":"AGUA"},{"$f":"ListaCriterios!H92","v":"3.2.02.a"},{"$f":"ListaCriterios!I92","v":0},{"$f":"ListaCriterios!J92","v":"¿Se dispone de plano de la red de saneamiento?"},{"$f":"ListaCriterios!K92","v":"SI/NO"}]
[{"$f":"ListaCriterios!B93","v":"Infrastructuras y servicios"},{"$f":"ListaCriterios!C93","v":"3.2"},{"$f":"ListaCriterios!D93","v":"Infrastructuras básicas"},{"$f":"ListaCriterios!E93","v":"3.2.2"},{"$f":"ListaCriterios!F93","v":"Saneamiento de agua"},{"$f":"ListaCriterios!G93","v":"AGUA"},{"$f":"ListaCriterios!H93","v":"3.2.02.b"},{"$f":"ListaCriterios!I93","v":0},{"$f":"ListaCriterios!J93","v":"¿La red de saneamiento es adecuada al tipo de área empresarial?"},{"$f":"ListaCriterios!K93","v":"SI/NO"}]
[{"$f":"ListaCriterios!B94","v":"Infrastructuras y servicios"},{"$f":"ListaCriterios!C94","v":"3.2"},{"$f":"ListaCriterios!D94","v":"Infrastructuras básicas"},{"$f":"ListaCriterios!E94","v":"3.2.2"},{"$f":"ListaCriterios!F94","v":"Saneamiento de agua"},{"$f":"ListaCriterios!G94","v":"AGUA"},{"$f":"ListaCriterios!H94","v":"3.2.02.c"},{"$f":"ListaCriterios!I94","v":0},{"$f":"ListaCriterios!J94","v":"¿La red de saneamiento está completamente en servicio?"},{"$f":"ListaCriterios!K94","v":"SI/NO"}]
[{"$f":"ListaCriterios!B95","v":"Infrastructuras y servicios"},{"$f":"ListaCriterios!C95","v":"3.2"},{"$f":"ListaCriterios!D95","v":"Infrastructuras básicas"},{"$f":"ListaCriterios!E95","v":"3.2.2"},{"$f":"ListaCriterios!F95","v":"Saneamiento de agua"},{"$f":"ListaCriterios!G95","v":"AGUA"},{"$f":"ListaCriterios!H95","v":"3.2.02.d"},{"$f":"ListaCriterios!I95","v":0},{"$f":"ListaCriterios!J95","v":"¿La red de saneamiento del PAE desagua en depuradora, del PAE o externa?"},{"$f":"ListaCriterios!K95","v":"SI/NO"}]
[{"$f":"ListaCriterios!B96","v":"Infrastructuras y servicios"},{"$f":"ListaCriterios!C96","v":"3.2"},{"$f":"ListaCriterios!D96","v":"Infrastructuras básicas"},{"$f":"ListaCriterios!E96","v":"3.2.2"},{"$f":"ListaCriterios!F96","v":"Saneamiento de agua"},{"$f":"ListaCriterios!G96","v":"AGUA"},{"$f":"ListaCriterios!H96","v":"3.2.02.e"},{"$f":"ListaCriterios!I96","v":"x"},{"$f":"ListaCriterios!J96","v":"¿Existe algún tipo de red de agua regenerada?"},{"$f":"ListaCriterios!K96","v":"SI/NO"}]
[{"$f":"ListaCriterios!B97","v":"Infrastructuras y servicios"},{"$f":"ListaCriterios!C97","v":"3.2"},{"$f":"ListaCriterios!D97","v":"Infrastructuras básicas"},{"$f":"ListaCriterios!E97","v":"3.2.2"},{"$f":"ListaCriterios!F97","v":"Saneamiento de agua"},{"$f":"ListaCriterios!G97","v":"AGUA"},{"$f":"ListaCriterios!H97","v":"3.2.02.e"},{"$f":"ListaCriterios!I97","v":0},{"$f":"ListaCriterios!J97","v":"La capacidad de depuración es adecuada a la tipología y volumen de empresas del área"},{"$f":"ListaCriterios!K97","v":"SI/NO"}]
[{"$f":"ListaCriterios!B98","v":"Infrastructuras y servicios"},{"$f":"ListaCriterios!C98","v":"3.2"},{"$f":"ListaCriterios!D98","v":"Infrastructuras básicas"},{"$f":"ListaCriterios!E98","v":"3.2.2"},{"$f":"ListaCriterios!F98","v":"Saneamiento de agua"},{"$f":"ListaCriterios!G98","v":"AGUA"},{"$f":"ListaCriterios!H98","v":"3.2.02.f"},{"$f":"ListaCriterios!I98","v":0},{"$f":"ListaCriterios!J98","v":"Proporción de empresas que tienen acceso a EDAR"},{"$f":"ListaCriterios!K98","v":"Grad 1-5"}]
[{"$f":"ListaCriterios!B99","v":"Infrastructuras y servicios"},{"$f":"ListaCriterios!C99","v":"3.2"},{"$f":"ListaCriterios!D99","v":"Infrastructuras básicas"},{"$f":"ListaCriterios!E99","v":"3.2.2"},{"$f":"ListaCriterios!F99","v":"Saneamiento de agua"},{"$f":"ListaCriterios!G99","v":"AGUA"},{"$f":"ListaCriterios!H99","v":"3.2.02.g"},{"$f":"ListaCriterios!I99","v":0},{"$f":"ListaCriterios!J99","v":"¿Cuál es el grado de extensión de la red de alcantarillado (grado de acceso de las empresas)?"},{"$f":"ListaCriterios!K99","v":"Grad 1-5"}]
[{"$f":"ListaCriterios!B100","v":"Infrastructuras y servicios"},{"$f":"ListaCriterios!C100","v":"3.2"},{"$f":"ListaCriterios!D100","v":"Infrastructuras básicas"},{"$f":"ListaCriterios!E100","v":"3.2.2"},{"$f":"ListaCriterios!F100","v":"Saneamiento de agua"},{"$f":"ListaCriterios!G100","v":"AGUA"},{"$f":"ListaCriterios!H100","v":"3.2.02.h"},{"$f":"ListaCriterios!I100","v":0},{"$f":"ListaCriterios!J100","v":"¿Se tiene acceso al contrato de prestación de servicio de red de saneamiento (por ejemplo, adjudicación pública del servicio)?"},{"$f":"ListaCriterios!K100","v":"SI/NO"}]
[{"$f":"ListaCriterios!B101","v":"Infrastructuras y servicios"},{"$f":"ListaCriterios!C101","v":"3.2"},{"$f":"ListaCriterios!D101","v":"Infrastructuras básicas"},{"$f":"ListaCriterios!E101","v":"3.2.2"},{"$f":"ListaCriterios!F101","v":"Saneamiento de agua"},{"$f":"ListaCriterios!G101","v":"AGUA"},{"$f":"ListaCriterios!H101","v":"3.2.02.i"},{"$f":"ListaCriterios!I101","v":0},{"$f":"ListaCriterios!J101","v":"¿Se tiene acceso a las analíticas periódicas del vertido?"},{"$f":"ListaCriterios!K101","v":"SI/NO"}]
[{"$f":"ListaCriterios!B102","v":"Infrastructuras y servicios"},{"$f":"ListaCriterios!C102","v":"3.2"},{"$f":"ListaCriterios!D102","v":"Infrastructuras básicas"},{"$f":"ListaCriterios!E102","v":"3.2.2"},{"$f":"ListaCriterios!F102","v":"Saneamiento de agua"},{"$f":"ListaCriterios!G102","v":"AGUA"},{"$f":"ListaCriterios!H102","v":"3.2.02.j"},{"$f":"ListaCriterios!I102","v":0},{"$f":"ListaCriterios!J102","v":"(En caso de ser específica del área) ¿La EDAR funciona correctamente y se mantiene de forma adecuada?"},{"$f":"ListaCriterios!K102","v":"SI/NO"}]
[{"$f":"ListaCriterios!B103","v":"Infrastructuras y servicios"},{"$f":"ListaCriterios!C103","v":"3.2"},{"$f":"ListaCriterios!D103","v":"Infrastructuras básicas"},{"$f":"ListaCriterios!E103","v":"3.2.2"},{"$f":"ListaCriterios!F103","v":"Saneamiento de agua"},{"$f":"ListaCriterios!G103","v":"AGUA"},{"$f":"ListaCriterios!H103","v":"3.2.02.k"},{"$f":"ListaCriterios!I103","v":0},{"$f":"ListaCriterios!J103","v":"¿Se tienen documentos oficiales que reflejan las principales características de la red de saneamiento (por ejemplo, pliego de condiciones técnicas de prestación de servicio)? ."},{"$f":"ListaCriterios!K103","v":"SI/NO"}]
[]
[null,null,null,null,null,null,null,null,{"$f":"E69","v":"Alumbrado público"}]
[]
[{"$f":"ListaCriterios!B104","v":"Infrastructuras y servicios"},{"$f":"ListaCriterios!C104","v":"3.2"},{"$f":"ListaCriterios!D104","v":"Infrastructuras básicas"},{"$f":"ListaCriterios!E104","v":"3.2.3"},{"$f":"ListaCriterios!F104","v":"Alumbrado público"},{"$f":"ListaCriterios!G104","v":"ENERGÍA Y CAMBIO CLIMATIC"},{"$f":"ListaCriterios!H104","v":"3.2.03.a"},{"$f":"ListaCriterios!I104","v":0},{"$f":"ListaCriterios!J104","v":"Cantidad de lámparas consideradas eficientes energéticamente (%)"},{"$f":"ListaCriterios!K104","v":"Grad 1-5"}]
[{"$f":"ListaCriterios!B105","v":"Infrastructuras y servicios"},{"$f":"ListaCriterios!C105","v":"3.2"},{"$f":"ListaCriterios!D105","v":"Infrastructuras básicas"},{"$f":"ListaCriterios!E105","v":"3.2.3"},{"$f":"ListaCriterios!F105","v":"Alumbrado público"},{"$f":"ListaCriterios!G105","v":"ENERGÍA Y CAMBIO CLIMATIC"},{"$f":"ListaCriterios!H105","v":"3.2.03.b"},{"$f":"ListaCriterios!I105","v":0},{"$f":"ListaCriterios!J105","v":"Superficie iluminada (%)"},{"$f":"ListaCriterios!K105","v":"Grad 1-5"}]
[{"$f":"ListaCriterios!B106","v":"Infrastructuras y servicios"},{"$f":"ListaCriterios!C106","v":"3.2"},{"$f":"ListaCriterios!D106","v":"Infrastructuras básicas"},{"$f":"ListaCriterios!E106","v":"3.2.3"},{"$f":"ListaCriterios!F106","v":"Alumbrado público"},{"$f":"ListaCriterios!G106","v":"ENERGÍA Y CAMBIO CLIMATIC"},{"$f":"ListaCriterios!H106","v":"3.2.03.c"},{"$f":"ListaCriterios!I106","v":0},{"$f":"ListaCriterios!J106","v":"¿Se tiene el Contrato de prestación de servicio de alumbrado público (por ejemplo, adjudicación pública del servicio)?"},{"$f":"ListaCriterios!K106","v":"SI/NO"}]
[{"$f":"ListaCriterios!B107","v":"Infrastructuras y servicios"},{"$f":"ListaCriterios!C107","v":"3.2"},{"$f":"ListaCriterios!D107","v":"Infrastructuras básicas"},{"$f":"ListaCriterios!E107","v":"3.2.3"},{"$f":"ListaCriterios!F107","v":"Alumbrado público"},{"$f":"ListaCriterios!G107","v":"ENERGÍA Y CAMBIO CLIMATIC"},{"$f":"ListaCriterios!H107","v":"3.2.03.d"},{"$f":"ListaCriterios!I107","v":0},{"$f":"ListaCriterios!J107","v":"¿Se dispone de Documentos oficiales que reflejan las principales características de la red de alumbrado publico (por ejemplo pliego condiciones técnicas de prestación de servicio)?"},{"$f":"ListaCriterios!K107","v":"SI/NO"}]
[{"$f":"ListaCriterios!B108","v":"Infrastructuras y servicios"},{"$f":"ListaCriterios!C108","v":"3.2"},{"$f":"ListaCriterios!D108","v":"Infrastructuras básicas"},{"$f":"ListaCriterios!E108","v":"3.2.3"},{"$f":"ListaCriterios!F108","v":"Alumbrado público"},{"$f":"ListaCriterios!G108","v":"ENERGÍA Y CAMBIO CLIMATIC"},{"$f":"ListaCriterios!H108","v":"3.2.03.e"},{"$f":"ListaCriterios!I108","v":0},{"$f":"ListaCriterios!J108","v":"¿Se dispone de planos de la red de alumbrado?"},{"$f":"ListaCriterios!K108","v":"SI/NO"}]
[{"$f":"ListaCriterios!B109","v":"Infrastructuras y servicios"},{"$f":"ListaCriterios!C109","v":"3.2"},{"$f":"ListaCriterios!D109","v":"Infrastructuras básicas"},{"$f":"ListaCriterios!E109","v":"3.2.3"},{"$f":"ListaCriterios!F109","v":"Alumbrado público"},{"$f":"ListaCriterios!G109","v":"ENERGÍA Y CAMBIO CLIMATIC"},{"$f":"ListaCriterios!H109","v":"3.2.03.f"},{"$f":"ListaCriterios!I109","v":0},{"$f":"ListaCriterios!J109","v":"Estado de conservación es adecuado, sin cableado al aire en cajas de conexiones y cuadros eléctricos públicos"},{"$f":"ListaCriterios!K109","v":"Grad 1-5"}]
[{"$f":"ListaCriterios!B110","v":"Infrastructuras y servicios"},{"$f":"ListaCriterios!C110","v":"3.2"},{"$f":"ListaCriterios!D110","v":"Infrastructuras básicas"},{"$f":"ListaCriterios!E110","v":"3.2.3"},{"$f":"ListaCriterios!F110","v":"Alumbrado público"},{"$f":"ListaCriterios!G110","v":"ENERGÍA Y CAMBIO CLIMATIC"},{"$f":"ListaCriterios!H110","v":"3.2.03.g"},{"$f":"ListaCriterios!I110","v":0},{"$f":"ListaCriterios!J110","v":"De ser requerido, hay elementos de alumbrado en zonas que requieren de visibilidad (paradas de transporte público...)"},{"$f":"ListaCriterios!K110","v":"SI/NO"}]
[{"$f":"ListaCriterios!B111","v":"Infrastructuras y servicios"},{"$f":"ListaCriterios!C111","v":"3.2"},{"$f":"ListaCriterios!D111","v":"Infrastructuras básicas"},{"$f":"ListaCriterios!E111","v":"3.2.3"},{"$f":"ListaCriterios!F111","v":"Alumbrado público"},{"$f":"ListaCriterios!G111","v":"ENERGÍA Y CAMBIO CLIMATIC"},{"$f":"ListaCriterios!H111","v":"3.2.03.h"},{"$f":"ListaCriterios!I111","v":0},{"$f":"ListaCriterios!J111","v":"¿Existe un protocolo definido con el titular de la infraestructura y éste se cumple?"},{"$f":"ListaCriterios!K111","v":"SI/NO"}]
[{"$f":"ListaCriterios!B112","v":"Infrastructuras y servicios"},{"$f":"ListaCriterios!C112","v":"3.2"},{"$f":"ListaCriterios!D112","v":"Infrastructuras básicas"},{"$f":"ListaCriterios!E112","v":"3.2.3"},{"$f":"ListaCriterios!F112","v":"Alumbrado público"},{"$f":"ListaCriterios!G112","v":"ENERGÍA Y CAMBIO CLIMATIC"},{"$f":"ListaCriterios!H112","v":"3.2.03.i"},{"$f":"ListaCriterios!I112","v":0},{"$f":"ListaCriterios!J112","v":"¿Está garantizada la adecuada visibilidad durante el horario de actividad habitual, de acuerdo con las circunstancias del entorno?"},{"$f":"ListaCriterios!K112","v":"SI/NO"}]
[]
[null,null,null,null,null,null,null,null,{"$f":"E81","v":"Red eléctrica"}]
[]
[{"$f":"ListaCriterios!B113","v":"Infrastructuras y servicios"},{"$f":"ListaCriterios!C113","v":"3.2"},{"$f":"ListaCriterios!D113","v":"Infrastructuras básicas"},{"$f":"ListaCriterios!E113","v":"3.2.4"},{"$f":"ListaCriterios!F113","v":"Red eléctrica"},{"$f":"ListaCriterios!G113","v":"ENERGÍA Y CAMBIO CLIMATIC"},{"$f":"ListaCriterios!H113","v":"3.2.04.a"},{"$f":"ListaCriterios!I113","v":0},{"$f":"ListaCriterios!J113","v":"¿Se dispone de Documentos oficiales que reflejan las principales características de la red/s de suministro energético (por ejemplo pliego condiciones técnicas de prestación de servicio)?"},{"$f":"ListaCriterios!K113","v":"SI/NO"}]
[{"$f":"ListaCriterios!B114","v":"Infrastructuras y servicios"},{"$f":"ListaCriterios!C114","v":"3.2"},{"$f":"ListaCriterios!D114","v":"Infrastructuras básicas"},{"$f":"ListaCriterios!E114","v":"3.2.4"},{"$f":"ListaCriterios!F114","v":"Red eléctrica"},{"$f":"ListaCriterios!G114","v":"ENERGÍA Y CAMBIO CLIMATIC"},{"$f":"ListaCriterios!H114","v":"3.2.04.b"},{"$f":"ListaCriterios!I114","v":0},{"$f":"ListaCriterios!J114","v":"¿Se dispone de Plano de las redes para el suministro energético?"},{"$f":"ListaCriterios!K114","v":"SI/NO"}]
[{"$f":"ListaCriterios!B115","v":"Infrastructuras y servicios"},{"$f":"ListaCriterios!C115","v":"3.2"},{"$f":"ListaCriterios!D115","v":"Infrastructuras básicas"},{"$f":"ListaCriterios!E115","v":"3.2.4"},{"$f":"ListaCriterios!F115","v":"Red eléctrica"},{"$f":"ListaCriterios!G115","v":"ENERGÍA Y CAMBIO CLIMATIC"},{"$f":"ListaCriterios!H115","v":"3.2.04.c"},{"$f":"ListaCriterios!I115","v":0},{"$f":"ListaCriterios!J115","v":"¿Se tiene el contrato/s de prestación de servicio de mantenimiento suministro energético (por ejemplo, adjudicación pública del servicio)?"},{"$f":"ListaCriterios!K115","v":"SI/NO"}]
[{"$f":"ListaCriterios!B116","v":"Infrastructuras y servicios"},{"$f":"ListaCriterios!C116","v":"3.2"},{"$f":"ListaCriterios!D116","v":"Infrastructuras básicas"},{"$f":"ListaCriterios!E116","v":"3.2.4"},{"$f":"ListaCriterios!F116","v":"Red eléctrica"},{"$f":"ListaCriterios!G116","v":"ENERGÍA Y CAMBIO CLIMATIC"},{"$f":"ListaCriterios!H116","v":"3.2.04.d"},{"$f":"ListaCriterios!I116","v":0},{"$f":"ListaCriterios!J116","v":"Estado de conservación de la red / redes de suministro energético"},{"$f":"ListaCriterios!K116","v":"Grad 1-5"}]
[{"$f":"ListaCriterios!B117","v":"Infrastructuras y servicios"},{"$f":"ListaCriterios!C117","v":"3.2"},{"$f":"ListaCriterios!D117","v":"Infrastructuras básicas"},{"$f":"ListaCriterios!E117","v":"3.2.4"},{"$f":"ListaCriterios!F117","v":"Red eléctrica"},{"$f":"ListaCriterios!G117","v":"ENERGÍA Y CAMBIO CLIMATIC"},{"$f":"ListaCriterios!H117","v":"3.2.04.e"},{"$f":"ListaCriterios!I117","v":0},{"$f":"ListaCriterios!J117","v":"¿Se considera que la red/s de suministro energético adecuadamente dimensionadas y capaces de suministrar suficiente energía a todas las parcelas?"},{"$f":"ListaCriterios!K117","v":"SI/NO"}]
[]
[null,null,null,null,null,null,null,null,{"$f":"E89","v":"Infraestructuras viarias"}]
[]
[{"$f":"ListaCriterios!B118","v":"Infrastructuras y servicios"},{"$f":"ListaCriterios!C118","v":"3.2"},{"$f":"ListaCriterios!D118","v":"Infrastructuras básicas"},{"$f":"ListaCriterios!E118","v":"3.2.5"},{"$f":"ListaCriterios!F118","v":"Infraestructuras viarias"},{"$f":"ListaCriterios!G118","v":"MOVILIDAD"},{"$f":"ListaCriterios!H118","v":"3.2.05.a"},{"$f":"ListaCriterios!I118","v":0},{"$f":"ListaCriterios!J118","v":"Cercanía a red primaria de carreteras"},{"$f":"ListaCriterios!K118","v":"Grad 1-5"}]
[{"$f":"ListaCriterios!B119","v":"Infrastructuras y servicios"},{"$f":"ListaCriterios!C119","v":"3.2"},{"$f":"ListaCriterios!D119","v":"Infrastructuras básicas"},{"$f":"ListaCriterios!E119","v":"3.2.5"},{"$f":"ListaCriterios!F119","v":"Infraestructuras viarias"},{"$f":"ListaCriterios!G119","v":"MOVILIDAD"},{"$f":"ListaCriterios!H119","v":"3.2.05.b"},{"$f":"ListaCriterios!I119","v":0},{"$f":"ListaCriterios!J119","v":"Existen elementos de pacificación (separadores, carriles, reductores de velocidad) en zonas de tráfico rápido y/o paso de personas"},{"$f":"ListaCriterios!K119","v":"SI/NO"}]
[{"$f":"ListaCriterios!B120","v":"Infrastructuras y servicios"},{"$f":"ListaCriterios!C120","v":"3.2"},{"$f":"ListaCriterios!D120","v":"Infrastructuras básicas"},{"$f":"ListaCriterios!E120","v":"3.2.5"},{"$f":"ListaCriterios!F120","v":"Infraestructuras viarias"},{"$f":"ListaCriterios!G120","v":"MOVILIDAD"},{"$f":"ListaCriterios!H120","v":"3.2.05.c"},{"$f":"ListaCriterios!I120","v":"x"},{"$f":"ListaCriterios!J120","v":"¿La red viaria al polígono está construida con materiales de alto índice de sostenibilidad?"},{"$f":"ListaCriterios!K120","v":"SI/NO"}]
[]
[null,null,null,null,null,null,null,null,{"$f":"E95","v":"Servicios para la movilidad sostenible"}]
[]
[{"$f":"ListaCriterios!B121","v":"Infrastructuras y servicios"},{"$f":"ListaCriterios!C121","v":"3.2"},{"$f":"ListaCriterios!D121","v":"Infrastructuras básicas"},{"$f":"ListaCriterios!E121","v":"3.2.6"},{"$f":"ListaCriterios!F121","v":"Servicios para la movilidad sostenible"},{"$f":"ListaCriterios!G121","v":"MOVILIDAD"},{"$f":"ListaCriterios!H121","v":"3.2.06.a"},{"$f":"ListaCriterios!I121","v":0},{"$f":"ListaCriterios!J121","v":"¿Existen informes o propuestas para la mejora de la movilidad y/o la intermodalidad en el área? (Plan de movilidad específico o equivalente)"},{"$f":"ListaCriterios!K121","v":"SI/NO"}]
[{"$f":"ListaCriterios!B122","v":"Infrastructuras y servicios"},{"$f":"ListaCriterios!C122","v":"3.2"},{"$f":"ListaCriterios!D122","v":"Infrastructuras básicas"},{"$f":"ListaCriterios!E122","v":"3.2.6"},{"$f":"ListaCriterios!F122","v":"Servicios para la movilidad sostenible"},{"$f":"ListaCriterios!G122","v":"MOVILIDAD"},{"$f":"ListaCriterios!H122","v":"3.2.06.b"},{"$f":"ListaCriterios!I122","v":"x"},{"$f":"ListaCriterios!J122","v":"¿Se dispone de espacios de aparcamiento para vehículos de transporte de mercancías accesibles, claramente delimitados y señalizados?"},{"$f":"ListaCriterios!K122","v":"SI/NO"}]
[{"$f":"ListaCriterios!B123","v":"Infrastructuras y servicios"},{"$f":"ListaCriterios!C123","v":"3.2"},{"$f":"ListaCriterios!D123","v":"Infrastructuras básicas"},{"$f":"ListaCriterios!E123","v":"3.2.6"},{"$f":"ListaCriterios!F123","v":"Servicios para la movilidad sostenible"},{"$f":"ListaCriterios!G123","v":"MOVILIDAD"},{"$f":"ListaCriterios!H123","v":"3.2.06.c"},{"$f":"ListaCriterios!I123","v":"x"},{"$f":"ListaCriterios!J123","v":"¿Existen políticas de aparcamiento para favorecer la movilidad sostenible?"},{"$f":"ListaCriterios!K123","v":"SI/NO"}]
[]
[null,null,null,null,null,null,null,null,{"$f":"E101","v":"Transporte público"}]
[]
[{"$f":"ListaCriterios!B124","v":"Infrastructuras y servicios"},{"$f":"ListaCriterios!C124","v":"3.2"},{"$f":"ListaCriterios!D124","v":"Infrastructuras básicas"},{"$f":"ListaCriterios!E124","v":"3.2.7"},{"$f":"ListaCriterios!F124","v":"Transporte público"},{"$f":"ListaCriterios!G124","v":"MOVILIDAD"},{"$f":"ListaCriterios!H124","v":"3.2.07.a"},{"$f":"ListaCriterios!I124","v":0},{"$f":"ListaCriterios!J124","v":"¿Se dispone de información disponible sobre el transporte público (líneas, recorridos, frecuencias...)?"},{"$f":"ListaCriterios!K124","v":"SI/NO"}]
[{"$f":"ListaCriterios!B125","v":"Infrastructuras y servicios"},{"$f":"ListaCriterios!C125","v":"3.2"},{"$f":"ListaCriterios!D125","v":"Infrastructuras básicas"},{"$f":"ListaCriterios!E125","v":"3.2.7"},{"$f":"ListaCriterios!F125","v":"Transporte público"},{"$f":"ListaCriterios!G125","v":"MOVILIDAD"},{"$f":"ListaCriterios!H125","v":"3.2.07.b"},{"$f":"ListaCriterios!I125","v":0},{"$f":"ListaCriterios!J125","v":"Proximidad, accesibilidad y estado de conservación de paradas de transporte público"},{"$f":"ListaCriterios!K125","v":"Grad 1-5"}]
[]
[null,null,null,null,null,null,null,null,{"$f":"E106","v":"Recorridos a pie o bicicleta"}]
[]
[{"$f":"ListaCriterios!B126","v":"Infrastructuras y servicios"},{"$f":"ListaCriterios!C126","v":"3.2"},{"$f":"ListaCriterios!D126","v":"Infrastructuras básicas"},{"$f":"ListaCriterios!E126","v":"3.2.8"},{"$f":"ListaCriterios!F126","v":"Recorridos a pie o bicicleta"},{"$f":"ListaCriterios!G126","v":"MOVILIDAD"},{"$f":"ListaCriterios!H126","v":"3.2.08.a"},{"$f":"ListaCriterios!I126","v":"x"},{"$f":"ListaCriterios!J126","v":"Adecuación de recorridos a pie o bicicleta"},{"$f":"ListaCriterios!K126","v":"Grad 1-5"}]
[]
[null,null,null,null,null,null,null,null,{"$f":"E110","v":"Zonas verdes y espacios de ocio"}]
[]
[{"$f":"ListaCriterios!B127","v":"Infrastructuras y servicios"},{"$f":"ListaCriterios!C127","v":"3.2"},{"$f":"ListaCriterios!D127","v":"Infrastructuras básicas"},{"$f":"ListaCriterios!E127","v":"3.2.9"},{"$f":"ListaCriterios!F127","v":"Zonas verdes y espacios de ocio"},{"$f":"ListaCriterios!G127","v":"CALIDAD DEL ESPACIO"},{"$f":"ListaCriterios!H127","v":"3.2.09.a"},{"$f":"ListaCriterios!I127","v":0},{"$f":"ListaCriterios!J127","v":"¿Se tiene Contrato de prestación de servicio de jardinería y zonas verdes y de ocio (por ejemplo, adjudicación pública del servicio)?"},{"$f":"ListaCriterios!K127","v":"SI/NO"}]
[{"$f":"ListaCriterios!B128","v":"Infrastructuras y servicios"},{"$f":"ListaCriterios!C128","v":"3.2"},{"$f":"ListaCriterios!D128","v":"Infrastructuras básicas"},{"$f":"ListaCriterios!E128","v":"3.2.9"},{"$f":"ListaCriterios!F128","v":"Zonas verdes y espacios de ocio"},{"$f":"ListaCriterios!G128","v":"CALIDAD DEL ESPACIO"},{"$f":"ListaCriterios!H128","v":"3.2.09.b"},{"$f":"ListaCriterios!I128","v":0},{"$f":"ListaCriterios!J128","v":"¿Se tienen documentos oficiales que reflejan las principales características de zonas verdes y de ocio (por ejemplo pliego condiciones técnicas de prestación de servicio)?"},{"$f":"ListaCriterios!K128","v":"SI/NO"}]
[{"$f":"ListaCriterios!B129","v":"Infrastructuras y servicios"},{"$f":"ListaCriterios!C129","v":"3.2"},{"$f":"ListaCriterios!D129","v":"Infrastructuras básicas"},{"$f":"ListaCriterios!E129","v":"3.2.9"},{"$f":"ListaCriterios!F129","v":"Zonas verdes y espacios de ocio"},{"$f":"ListaCriterios!G129","v":"CALIDAD DEL ESPACIO"},{"$f":"ListaCriterios!H129","v":"3.2.09.c"},{"$f":"ListaCriterios!I129","v":0},{"$f":"ListaCriterios!J129","v":"Accesibilidad de zonas verdes y espacios de ocio, sin barreras arquitectónicas y acceso en condiciones de seguridad"},{"$f":"ListaCriterios!K129","v":"SI/NO"}]
[{"$f":"ListaCriterios!B130","v":"Infrastructuras y servicios"},{"$f":"ListaCriterios!C130","v":"3.2"},{"$f":"ListaCriterios!D130","v":"Infrastructuras básicas"},{"$f":"ListaCriterios!E130","v":"3.2.9"},{"$f":"ListaCriterios!F130","v":"Zonas verdes y espacios de ocio"},{"$f":"ListaCriterios!G130","v":"CALIDAD DEL ESPACIO"},{"$f":"ListaCriterios!H130","v":"3.2.09.d"},{"$f":"ListaCriterios!I130","v":0},{"$f":"ListaCriterios!J130","v":"Estado de conservación y mantenimiento de zonas verdes y espacios de ocio"},{"$f":"ListaCriterios!K130","v":"Grad 1-5"}]
[{"$f":"ListaCriterios!B131","v":"Infrastructuras y servicios"},{"$f":"ListaCriterios!C131","v":"3.2"},{"$f":"ListaCriterios!D131","v":"Infrastructuras básicas"},{"$f":"ListaCriterios!E131","v":"3.2.9"},{"$f":"ListaCriterios!F131","v":"Zonas verdes y espacios de ocio"},{"$f":"ListaCriterios!G131","v":"CALIDAD DEL ESPACIO"},{"$f":"ListaCriterios!H131","v":"3.2.09.e"},{"$f":"ListaCriterios!I131","v":0},{"$f":"ListaCriterios!J131","v":"¿Existe información visible con los datos de contacto en caso de incidentes?"},{"$f":"ListaCriterios!K131","v":"SI/NO"}]
[{"$f":"ListaCriterios!B132","v":"Infrastructuras y servicios"},{"$f":"ListaCriterios!C132","v":"3.2"},{"$f":"ListaCriterios!D132","v":"Infrastructuras básicas"},{"$f":"ListaCriterios!E132","v":"3.2.9"},{"$f":"ListaCriterios!F132","v":"Zonas verdes y espacios de ocio"},{"$f":"ListaCriterios!G132","v":"CALIDAD DEL ESPACIO"},{"$f":"ListaCriterios!H132","v":"3.2.09.f"},{"$f":"ListaCriterios!I132","v":0},{"$f":"ListaCriterios!J132","v":"Los espacios verdes y de ocio son existentes y están habilitados para cada tipo de usuario (por edades, por finalidad, animales, etc) están adecuadamente delimitados e identificados, así como las normas de uso seguro de las instalaciones asignadas a cada uno de ellos?"},{"$f":"ListaCriterios!K132","v":"SI/NO"}]
[{"$f":"ListaCriterios!B133","v":"Infrastructuras y servicios"},{"$f":"ListaCriterios!C133","v":"3.2"},{"$f":"ListaCriterios!D133","v":"Infrastructuras básicas"},{"$f":"ListaCriterios!E133","v":"3.2.9"},{"$f":"ListaCriterios!F133","v":"Zonas verdes y espacios de ocio"},{"$f":"ListaCriterios!G133","v":"CALIDAD DEL ESPACIO"},{"$f":"ListaCriterios!H133","v":"3.2.09.g"},{"$f":"ListaCriterios!I133","v":"x"},{"$f":"ListaCriterios!J133","v":"Existen espacios habilitados para el uso deportivo (bicicletas, patinaje, etc.) y están adecuadamente señalizados y delimitados en condiciones de seguridad para evitar accidentes con otros usuarios de los espacios"},{"$f":"ListaCriterios!K133","v":"SI/NO"}]
[]
[null,null,null,null,null,null,null,null,{"$f":"E120","v":"Infraest. por emergencias"}]
[]
[{"$f":"ListaCriterios!B134","v":"Infrastructuras y servicios"},{"$f":"ListaCriterios!C134","v":"3.2"},{"$f":"ListaCriterios!D134","v":"Infrastructuras básicas"},{"$f":"ListaCriterios!E134","v":"3.2.10"},{"$f":"ListaCriterios!F134","v":"Infraest. por emergencias"},{"$f":"ListaCriterios!G134","v":"SEGURIDAD"},{"$f":"ListaCriterios!H134","v":"3.2.10.a"},{"$f":"ListaCriterios!I134","v":0},{"$f":"ListaCriterios!J134","v":"¿Existe un punto de encuentro en una ubicación segura dentro del área empresarial, señalizado y accesible?"},{"$f":"ListaCriterios!K134","v":"SI/NO"}]
[{"$f":"ListaCriterios!B135","v":"Infrastructuras y servicios"},{"$f":"ListaCriterios!C135","v":"3.2"},{"$f":"ListaCriterios!D135","v":"Infrastructuras básicas"},{"$f":"ListaCriterios!E135","v":"3.2.10"},{"$f":"ListaCriterios!F135","v":"Infraest. por emergencias"},{"$f":"ListaCriterios!G135","v":"SEGURIDAD"},{"$f":"ListaCriterios!H135","v":"3.2.10.b"},{"$f":"ListaCriterios!I135","v":0},{"$f":"ListaCriterios!J135","v":"¿Existe señalización de emergencias y permite un adecuado desalojo en caso necesario?"},{"$f":"ListaCriterios!K135","v":"SI/NO"}]
[{"$f":"ListaCriterios!B136","v":"Infrastructuras y servicios"},{"$f":"ListaCriterios!C136","v":"3.2"},{"$f":"ListaCriterios!D136","v":"Infrastructuras básicas"},{"$f":"ListaCriterios!E136","v":"3.2.10"},{"$f":"ListaCriterios!F136","v":"Infraest. por emergencias"},{"$f":"ListaCriterios!G136","v":"SEGURIDAD"},{"$f":"ListaCriterios!H136","v":"3.2.10.c"},{"$f":"ListaCriterios!I136","v":0},{"$f":"ListaCriterios!J136","v":"¿Existen evidencias de realización de simulacros o pruebas en la red de emergencias, y de adecuación de ésta a las necesidades del área?"},{"$f":"ListaCriterios!K136","v":"SI/NO"}]
[{"$f":"ListaCriterios!B137","v":"Infrastructuras y servicios"},{"$f":"ListaCriterios!C137","v":"3.2"},{"$f":"ListaCriterios!D137","v":"Infrastructuras básicas"},{"$f":"ListaCriterios!E137","v":"3.2.10"},{"$f":"ListaCriterios!F137","v":"Infraest. por emergencias"},{"$f":"ListaCriterios!G137","v":"SEGURIDAD"},{"$f":"ListaCriterios!H137","v":"3.2.10.d"},{"$f":"ListaCriterios!I137","v":0},{"$f":"ListaCriterios!J137","v":"Hay red de hidrantes y está en buen estado de conservación"},{"$f":"ListaCriterios!K137","v":"SI/NO"}]
[{"$f":"ListaCriterios!B138","v":"Infrastructuras y servicios"},{"$f":"ListaCriterios!C138","v":"3.2"},{"$f":"ListaCriterios!D138","v":"Infrastructuras básicas"},{"$f":"ListaCriterios!E138","v":"3.2.10"},{"$f":"ListaCriterios!F138","v":"Infraest. por emergencias"},{"$f":"ListaCriterios!G138","v":"SEGURIDAD"},{"$f":"ListaCriterios!H138","v":"3.2.10.e"},{"$f":"ListaCriterios!I138","v":0},{"$f":"ListaCriterios!J138","v":"¿La señalización de las tomas de la red de hidrantes es adecuada para asegurar que no se obstruyen y son funcionales?"},{"$f":"ListaCriterios!K138","v":"SI/NO"}]
[{"$f":"ListaCriterios!B139","v":"Infrastructuras y servicios"},{"$f":"ListaCriterios!C139","v":"3.2"},{"$f":"ListaCriterios!D139","v":"Infrastructuras básicas"},{"$f":"ListaCriterios!E139","v":"3.2.10"},{"$f":"ListaCriterios!F139","v":"Infraest. por emergencias"},{"$f":"ListaCriterios!G139","v":"SEGURIDAD"},{"$f":"ListaCriterios!H139","v":"3.2.10.f"},{"$f":"ListaCriterios!I139","v":0},{"$f":"ListaCriterios!J139","v":"¿Se dispone de Plano de la red de hidrantes?"},{"$f":"ListaCriterios!K139","v":"SI/NO"}]
[{"$f":"ListaCriterios!B140","v":"Infrastructuras y servicios"},{"$f":"ListaCriterios!C140","v":"3.2"},{"$f":"ListaCriterios!D140","v":"Infrastructuras básicas"},{"$f":"ListaCriterios!E140","v":"3.2.10"},{"$f":"ListaCriterios!F140","v":"Infraest. por emergencias"},{"$f":"ListaCriterios!G140","v":"SEGURIDAD"},{"$f":"ListaCriterios!H140","v":"3.2.10.g"},{"$f":"ListaCriterios!I140","v":0},{"$f":"ListaCriterios!J140","v":"¿Se tiene Contrato con organización que lleva a cabo el mantenimiento de hidrantes según la legislación vigente?"},{"$f":"ListaCriterios!K140","v":"SI/NO"}]
[{"$f":"ListaCriterios!B141","v":"Infrastructuras y servicios"},{"$f":"ListaCriterios!C141","v":"3.2"},{"$f":"ListaCriterios!D141","v":"Infrastructuras básicas"},{"$f":"ListaCriterios!E141","v":"3.2.10"},{"$f":"ListaCriterios!F141","v":"Infraest. por emergencias"},{"$f":"ListaCriterios!G141","v":"SEGURIDAD"},{"$f":"ListaCriterios!H141","v":"3.2.10.h"},{"$f":"ListaCriterios!I141","v":0},{"$f":"ListaCriterios!J141","v":"¿Se dispone de Documentos oficiales que reflejan las principales características de la red de hidrantes (por ejemplo pliego condiciones técnicas de prestación de servicio)?"},{"$f":"ListaCriterios!K141","v":"SI/NO"}]
[{"$f":"ListaCriterios!B142","v":"Infrastructuras y servicios"},{"$f":"ListaCriterios!C142","v":"3.2"},{"$f":"ListaCriterios!D142","v":"Infrastructuras básicas"},{"$f":"ListaCriterios!E142","v":"3.2.10"},{"$f":"ListaCriterios!F142","v":"Infraest. por emergencias"},{"$f":"ListaCriterios!G142","v":"SEGURIDAD"},{"$f":"ListaCriterios!H142","v":"3.2.10.i"},{"$f":"ListaCriterios!I142","v":0},{"$f":"ListaCriterios!J142","v":"¿Se dispone de registros mantenimiento que evidencien la puesta en marcha periódica y mantenimiento de la red de hidrantes según establece el RD 513/2017?"},{"$f":"ListaCriterios!K142","v":"SI/NO"}]
[]
[null,null,null,null,null,null,null,null,{"$f":"E132","v":"Telecomunicaciones"}]
[]
[{"$f":"ListaCriterios!B143","v":"Infrastructuras y servicios"},{"$f":"ListaCriterios!C143","v":"3.2"},{"$f":"ListaCriterios!D143","v":"Infrastructuras básicas"},{"$f":"ListaCriterios!E143","v":"3.2.11"},{"$f":"ListaCriterios!F143","v":"Telecomunicaciones"},{"$f":"ListaCriterios!G143","v":"TELECOMUNICACIONES"},{"$f":"ListaCriterios!H143","v":"3.2.11.a"},{"$f":"ListaCriterios!I143","v":"x"},{"$f":"ListaCriterios!J143","v":"¿Llega cobertura de Fibra Óptica en el PAE?"},{"$f":"ListaCriterios!K143","v":"SI/NO"}]
[{"$f":"ListaCriterios!B144","v":"Infrastructuras y servicios"},{"$f":"ListaCriterios!C144","v":"3.2"},{"$f":"ListaCriterios!D144","v":"Infrastructuras básicas"},{"$f":"ListaCriterios!E144","v":"3.2.11"},{"$f":"ListaCriterios!F144","v":"Telecomunicaciones"},{"$f":"ListaCriterios!G144","v":"TELECOMUNICACIONES"},{"$f":"ListaCriterios!H144","v":"3.2.11.b"},{"$f":"ListaCriterios!I144","v":0},{"$f":"ListaCriterios!J144","v":"Existe cobertura para servicios móviles en toda el área."},{"$f":"ListaCriterios!K144","v":"SI/NO"}]
[{"$f":"ListaCriterios!B145","v":"Infrastructuras y servicios"},{"$f":"ListaCriterios!C145","v":"3.2"},{"$f":"ListaCriterios!D145","v":"Infrastructuras básicas"},{"$f":"ListaCriterios!E145","v":"3.2.11"},{"$f":"ListaCriterios!F145","v":"Telecomunicaciones"},{"$f":"ListaCriterios!G145","v":"TELECOMUNICACIONES"},{"$f":"ListaCriterios!H145","v":"3.2.11.c"},{"$f":"ListaCriterios!I145","v":"x"},{"$f":"ListaCriterios!J145","v":"¿Existe cobertura móvil de alta velocidad 4G+, 5G?"},{"$f":"ListaCriterios!K145","v":"Grad 1-5"}]
[{"$f":"ListaCriterios!B146","v":"Infrastructuras y servicios"},{"$f":"ListaCriterios!C146","v":"3.2"},{"$f":"ListaCriterios!D146","v":"Infrastructuras básicas"},{"$f":"ListaCriterios!E146","v":"3.2.11"},{"$f":"ListaCriterios!F146","v":"Telecomunicaciones"},{"$f":"ListaCriterios!G146","v":"TELECOMUNICACIONES"},{"$f":"ListaCriterios!H146","v":"3.2.11.d"},{"$f":"ListaCriterios!I146","v":0},{"$f":"ListaCriterios!J146","v":"Grado de despliegue y velocidad de la red telecomunicaciones en el PAE"},{"$f":"ListaCriterios!K146","v":"Grad 1-5"}]
[{"$f":"ListaCriterios!B147","v":"Infrastructuras y servicios"},{"$f":"ListaCriterios!C147","v":"3.2"},{"$f":"ListaCriterios!D147","v":"Infrastructuras básicas"},{"$f":"ListaCriterios!E147","v":"3.2.11"},{"$f":"ListaCriterios!F147","v":"Telecomunicaciones"},{"$f":"ListaCriterios!G147","v":"TELECOMUNICACIONES"},{"$f":"ListaCriterios!H147","v":"3.2.11.e"},{"$f":"ListaCriterios!I147","v":0},{"$f":"ListaCriterios!J147","v":"Las antenas repetidoras de señal en zonas públicas (en su caso) están señalizadas y con acceso controlado"},{"$f":"ListaCriterios!K147","v":"SI/NO"}]
[{"$f":"ListaCriterios!B148","v":"Infrastructuras y servicios"},{"$f":"ListaCriterios!C148","v":"3.2"},{"$f":"ListaCriterios!D148","v":"Infrastructuras básicas"},{"$f":"ListaCriterios!E148","v":"3.2.11"},{"$f":"ListaCriterios!F148","v":"Telecomunicaciones"},{"$f":"ListaCriterios!G148","v":"TELECOMUNICACIONES"},{"$f":"ListaCriterios!H148","v":"3.2.11.f"},{"$f":"ListaCriterios!I148","v":0},{"$f":"ListaCriterios!J148","v":"Las información sobre las características de la red de comunicaciones aparecen adecuadamente reflejadas en la publicidad del área"},{"$f":"ListaCriterios!K148","v":"SI/NO"}]
[{"$f":"ListaCriterios!B149","v":"Infrastructuras y servicios"},{"$f":"ListaCriterios!C149","v":"3.2"},{"$f":"ListaCriterios!D149","v":"Infrastructuras básicas"},{"$f":"ListaCriterios!E149","v":"3.2.11"},{"$f":"ListaCriterios!F149","v":"Telecomunicaciones"},{"$f":"ListaCriterios!G149","v":"TELECOMUNICACIONES"},{"$f":"ListaCriterios!H149","v":"3.2.11.g"},{"$f":"ListaCriterios!I149","v":0},{"$f":"ListaCriterios!J149","v":"¿Se dispone de Documentos oficiales que reflejan las principales características de la red telecomunicaciones (por ejemplo pliego condiciones técnicas de prestación de servicio)?"},{"$f":"ListaCriterios!K149","v":"SI/NO"}]
[{"$f":"ListaCriterios!B150","v":"Infrastructuras y servicios"},{"$f":"ListaCriterios!C150","v":"3.2"},{"$f":"ListaCriterios!D150","v":"Infrastructuras básicas"},{"$f":"ListaCriterios!E150","v":"3.2.11"},{"$f":"ListaCriterios!F150","v":"Telecomunicaciones"},{"$f":"ListaCriterios!G150","v":"TELECOMUNICACIONES"},{"$f":"ListaCriterios!H150","v":"3.2.11.h"},{"$f":"ListaCriterios!I150","v":0},{"$f":"ListaCriterios!J150","v":"Estado de conservación de elementos visibles de la red de comunicaciones. Especialmente, en su caso, las casetas o cajas de conexiones"},{"$f":"ListaCriterios!K150","v":"Grad 1-5"}]
[{"$f":"ListaCriterios!B151","v":"Infrastructuras y servicios"},{"$f":"ListaCriterios!C151","v":"3.2"},{"$f":"ListaCriterios!D151","v":"Infrastructuras básicas"},{"$f":"ListaCriterios!E151","v":"3.2.11"},{"$f":"ListaCriterios!F151","v":"Telecomunicaciones"},{"$f":"ListaCriterios!G151","v":"TELECOMUNICACIONES"},{"$f":"ListaCriterios!H151","v":"3.2.11.i"},{"$f":"ListaCriterios!I151","v":0},{"$f":"ListaCriterios!J151","v":"¿Se tiene el contrato de prestación de servicio de telecomunicaciones (por ejemplo, adjudicación pública del servicio)?"},{"$f":"ListaCriterios!K151","v":"SI/NO"}]
[{"$f":"ListaCriterios!B152","v":"Infrastructuras y servicios"},{"$f":"ListaCriterios!C152","v":"3.2"},{"$f":"ListaCriterios!D152","v":"Infrastructuras básicas"},{"$f":"ListaCriterios!E152","v":"3.2.11"},{"$f":"ListaCriterios!F152","v":"Telecomunicaciones"},{"$f":"ListaCriterios!G152","v":"TELECOMUNICACIONES"},{"$f":"ListaCriterios!H152","v":"3.2.11.j"},{"$f":"ListaCriterios!I152","v":0},{"$f":"ListaCriterios!J152","v":"¿Se dispone de Plano de canalizaciones (de ser el caso, por proveedor)?"},{"$f":"ListaCriterios!K152","v":"SI/NO"}]
[{"$f":"ListaCriterios!B153","v":"Infrastructuras y servicios"},{"$f":"ListaCriterios!C153","v":"3.2"},{"$f":"ListaCriterios!D153","v":"Infrastructuras básicas"},{"$f":"ListaCriterios!E153","v":"3.2.11"},{"$f":"ListaCriterios!F153","v":"Telecomunicaciones"},{"$f":"ListaCriterios!G153","v":"TELECOMUNICACIONES"},{"$f":"ListaCriterios!H153","v":"3.2.11.k"},{"$f":"ListaCriterios!I153","v":0},{"$f":"ListaCriterios!J153","v":"¿Se dispone de registro de incidencias (graves) en la infraestructura?"},{"$f":"ListaCriterios!K153","v":"SI/NO"}]
[]
[null,null,null,null,null,null,null,null,{"$f":"C160","v":"Servicios avanzados y/o compartidos"}]
[]
[null,null,null,null,null,null,null,null,{"$f":"E148","v":"financiación"}]
[]
[{"$f":"ListaCriterios!B154","v":"Infrastructuras y servicios"},{"$f":"ListaCriterios!C154","v":"3.3"},{"$f":"ListaCriterios!D154","v":"Serveis avançats i/o compartits"},{"$f":"ListaCriterios!E154","v":"3.3.1"},{"$f":"ListaCriterios!F154","v":"financiación"},{"$f":"ListaCriterios!G154","v":"COLABORACIÓN"},{"$f":"ListaCriterios!H154","v":"3.3.01.a"},{"$f":"ListaCriterios!I154","v":"x"},{"$f":"ListaCriterios!J154","v":"¿Se ofrecen servicios especiales de financiación a las empresas? (Gestor financiero)"},{"$f":"ListaCriterios!K154","v":"SI/NO"}]
[]
[null,null,null,null,null,null,null,null,{"$f":"E152","v":"Asistencia a la innovación"}]
[]
[{"$f":"ListaCriterios!B155","v":"Infrastructuras y servicios"},{"$f":"ListaCriterios!C155","v":"3.3"},{"$f":"ListaCriterios!D155","v":"Servicios avanzados y/o compartidos"},{"$f":"ListaCriterios!E155","v":"3.3.2"},{"$f":"ListaCriterios!F155","v":"Asistencia a la innovación"},{"$f":"ListaCriterios!G155","v":"COLABORACIÓN"},{"$f":"ListaCriterios!H155","v":"3.3.02.a"},{"$f":"ListaCriterios!I155","v":"x"},{"$f":"ListaCriterios!J155","v":"¿Se ofrece servicio para ayudar a las empresas a innovar?"},{"$f":"ListaCriterios!K155","v":"SI/NO"}]
[]
[null,null,null,null,null,null,null,null,{"$f":"E156","v":"Centro de servicios"}]
[]
[{"$f":"ListaCriterios!B156","v":"Infrastructuras y servicios"},{"$f":"ListaCriterios!C156","v":"3.3"},{"$f":"ListaCriterios!D156","v":"Servicios avanzados y/o compartidos"},{"$f":"ListaCriterios!E156","v":"3.3.3"},{"$f":"ListaCriterios!F156","v":"Centro de servicios"},{"$f":"ListaCriterios!G156","v":"COLABORACIÓN"},{"$f":"ListaCriterios!H156","v":"3.3.03.a"},{"$f":"ListaCriterios!I156","v":"x"},{"$f":"ListaCriterios!J156","v":"¿Existe un centro físico/oficina/oficina virtual de servicios?"},{"$f":"ListaCriterios!K156","v":"SI/NO"}]
[]
[null,null,null,null,null,null,null,null,{"$f":"E160","v":"Gestor energética/ambiental"}]
[]
[{"$f":"ListaCriterios!B157","v":"Infrastructuras y servicios"},{"$f":"ListaCriterios!C157","v":"3.3"},{"$f":"ListaCriterios!D157","v":"Servicios avanzados y/o compartidos"},{"$f":"ListaCriterios!E157","v":"3.3.4"},{"$f":"ListaCriterios!F157","v":"Gestor energética/ambiental"},{"$f":"ListaCriterios!G157","v":"ENERGÍA Y CAMBIO CLIMATIC"},{"$f":"ListaCriterios!H157","v":"3.3.04.a"},{"$f":"ListaCriterios!I157","v":"x"},{"$f":"ListaCriterios!J157","v":"¿Se promociona la energía compartida desde la gestión del PAE?"},{"$f":"ListaCriterios!K157","v":"SI/NO"}]
[{"$f":"ListaCriterios!B158","v":"Infrastructuras y servicios"},{"$f":"ListaCriterios!C158","v":"3.3"},{"$f":"ListaCriterios!D158","v":"Servicios avanzados y/o compartidos"},{"$f":"ListaCriterios!E158","v":"3.3.4"},{"$f":"ListaCriterios!F158","v":"Gestor energética/ambiental"},{"$f":"ListaCriterios!G158","v":"ENERGÍA Y CAMBIO CLIMATIC"},{"$f":"ListaCriterios!H158","v":"3.3.04.b"},{"$f":"ListaCriterios!I158","v":"x"},{"$f":"ListaCriterios!J158","v":"¿Se ofrece una central de compras en materia energética (placas solares, comprar verde energética, etc)?"},{"$f":"ListaCriterios!K158","v":"SI/NO"}]
[{"$f":"ListaCriterios!B159","v":"Infrastructuras y servicios"},{"$f":"ListaCriterios!C159","v":"3.3"},{"$f":"ListaCriterios!D159","v":"Servicios avanzados y/o compartidos"},{"$f":"ListaCriterios!E159","v":"3.3.4"},{"$f":"ListaCriterios!F159","v":"Gestor energética/ambiental"},{"$f":"ListaCriterios!G159","v":"ENERGÍA Y CAMBIO CLIMATIC"},{"$f":"ListaCriterios!H159","v":"3.3.04.c"},{"$f":"ListaCriterios!I159","v":"x"},{"$f":"ListaCriterios!J159","v":"¿Existe la figura del gestor energético y/o gestor ambiental?"},{"$f":"ListaCriterios!K159","v":"SI/NO"}]
[]
[null,null,null,null,null,null,null,null,{"$f":"E166","v":"Servicios para la movilidad sostenible"}]
[]
[{"$f":"ListaCriterios!B160","v":"Infrastructuras y servicios"},{"$f":"ListaCriterios!C160","v":"3.3"},{"$f":"ListaCriterios!D160","v":"Servicios avanzados y/o compartidos"},{"$f":"ListaCriterios!E160","v":"3.3.5"},{"$f":"ListaCriterios!F160","v":"Servicios para la movilidad sostenible"},{"$f":"ListaCriterios!G160","v":"MOVILIDAD"},{"$f":"ListaCriterios!H160","v":"3.3.05.a"},{"$f":"ListaCriterios!I160","v":"x"},{"$f":"ListaCriterios!J160","v":"¿Se ha puesto en marcha o implulsado algún servicio de vehículos compartidos? (Carsharing, bicicletas compartidas, motocicletas eléctricas, patinetes…)"},{"$f":"ListaCriterios!K160","v":"SI/NO"}]
[{"$f":"ListaCriterios!B161","v":"Infrastructuras y servicios"},{"$f":"ListaCriterios!C161","v":"3.3"},{"$f":"ListaCriterios!D161","v":"Servicios avanzados y/o compartidos"},{"$f":"ListaCriterios!E161","v":"3.3.6"},{"$f":"ListaCriterios!F161","v":"Servicios a la exportación"},{"$f":"ListaCriterios!G161","v":"MOVILIDAD"},{"$f":"ListaCriterios!H161","v":"3.3.06.a"},{"$f":"ListaCriterios!I161","v":"x"},{"$f":"ListaCriterios!J161","v":"¿Se ofrecen servicios para facilitar la distribución de mercancías?"},{"$f":"ListaCriterios!K161","v":"SI/NO"}]
[]
[null,null,null,null,null,null,null,null,{"$f":"E171","v":"Mensajería y logística"}]
[]
[{"$f":"ListaCriterios!B162","v":"Infrastructuras y servicios"},{"$f":"ListaCriterios!C162","v":"3.3"},{"$f":"ListaCriterios!D162","v":"Servicios avanzados y/o compartidos"},{"$f":"ListaCriterios!E162","v":"3.3.7"},{"$f":"ListaCriterios!F162","v":"Mensajería y logística"},{"$f":"ListaCriterios!G162","v":"MOVILIDAD"},{"$f":"ListaCriterios!H162","v":"3.3.07.a"},{"$f":"ListaCriterios!I162","v":"x"},{"$f":"ListaCriterios!J162","v":"¿Se dispone de servicio mancomunado de mensajería?"},{"$f":"ListaCriterios!K162","v":"SI/NO"}]
[{"$f":"ListaCriterios!B163","v":"Infrastructuras y servicios"},{"$f":"ListaCriterios!C163","v":"3.3"},{"$f":"ListaCriterios!D163","v":"Servicios avanzados y/o compartidos"},{"$f":"ListaCriterios!E163","v":"3.3.7"},{"$f":"ListaCriterios!F163","v":"Mensajería y logística"},{"$f":"ListaCriterios!G163","v":"MOVILIDAD"},{"$f":"ListaCriterios!H163","v":"3.3.07.b"},{"$f":"ListaCriterios!I163","v":"x"},{"$f":"ListaCriterios!J163","v":"¿Se dispone de servicios logísticos compartidos o integrados?"},{"$f":"ListaCriterios!K163","v":"SI/NO"}]
[]
[null,null,null,null,null,null,null,null,{"$f":"E176","v":"Movilidad compartida"}]
[]
[{"$f":"ListaCriterios!B164","v":"Infrastructuras y servicios"},{"$f":"ListaCriterios!C164","v":"3.3"},{"$f":"ListaCriterios!D164","v":"Servicios avanzados y/o compartidos"},{"$f":"ListaCriterios!E164","v":"3.3.8"},{"$f":"ListaCriterios!F164","v":"Movilidad compartida"},{"$f":"ListaCriterios!G164","v":"MOVILIDAD"},{"$f":"ListaCriterios!H164","v":"3.3.08.a"},{"$f":"ListaCriterios!I164","v":"x"},{"$f":"ListaCriterios!J164","v":"¿Se ofrece o promociona algún sistema o plataforma de movilidad compartida por trabajadores?"},{"$f":"ListaCriterios!K164","v":"SI/NO"}]
[]
[null,null,null,null,null,null,null,null,{"$f":"E180","v":"Mantenimiento de parcelas vacías"}]
[]
[{"$f":"ListaCriterios!B165","v":"Infrastructuras y servicios"},{"$f":"ListaCriterios!C165","v":"3.3"},{"$f":"ListaCriterios!D165","v":"Servicios avanzados y/o compartidos"},{"$f":"ListaCriterios!E165","v":"3.3.9"},{"$f":"ListaCriterios!F165","v":"Mantenimiento de parcelas vacías"},{"$f":"ListaCriterios!G165","v":"CALIDAD DEL ESPACIO"},{"$f":"ListaCriterios!H165","v":"3.3.09.a"},{"$f":"ListaCriterios!I165","v":"x"},{"$f":"ListaCriterios!J165","v":"¿Se tiene una relación de las parcelas vacías y ubicación en planos?"},{"$f":"ListaCriterios!K165","v":"SI/NO"}]
[{"$f":"ListaCriterios!B166","v":"Infrastructuras y servicios"},{"$f":"ListaCriterios!C166","v":"3.3"},{"$f":"ListaCriterios!D166","v":"Servicios avanzados y/o compartidos"},{"$f":"ListaCriterios!E166","v":"3.3.9"},{"$f":"ListaCriterios!F166","v":"Mantenimiento de parcelas vacías"},{"$f":"ListaCriterios!G166","v":"CALIDAD DEL ESPACIO"},{"$f":"ListaCriterios!H166","v":"3.3.09.b"},{"$f":"ListaCriterios!I166","v":"x"},{"$f":"ListaCriterios!J166","v":"¿Se tienen registros asociados al mantenimiento de parcelas (por ejemplo, limpieza de maleza, residuos etc.)?"},{"$f":"ListaCriterios!K166","v":"SI/NO"}]
[{"$f":"ListaCriterios!B167","v":"Infrastructuras y servicios"},{"$f":"ListaCriterios!C167","v":"3.3"},{"$f":"ListaCriterios!D167","v":"Servicios avanzados y/o compartidos"},{"$f":"ListaCriterios!E167","v":"3.3.9"},{"$f":"ListaCriterios!F167","v":"Mantenimiento de parcelas vacías"},{"$f":"ListaCriterios!G167","v":"CALIDAD DEL ESPACIO"},{"$f":"ListaCriterios!H167","v":"3.3.09.c"},{"$f":"ListaCriterios!I167","v":"x"},{"$f":"ListaCriterios!J167","v":"Estado de las parcelas vacías"},{"$f":"ListaCriterios!K167","v":"Grad 1-5"}]
[{"$f":"ListaCriterios!B168","v":"Infrastructuras y servicios"},{"$f":"ListaCriterios!C168","v":"3.3"},{"$f":"ListaCriterios!D168","v":"Servicios avanzados y/o compartidos"},{"$f":"ListaCriterios!E168","v":"3.3.9"},{"$f":"ListaCriterios!F168","v":"Mantenimiento de parcelas vacías"},{"$f":"ListaCriterios!G168","v":"CALIDAD DEL ESPACIO"},{"$f":"ListaCriterios!H168","v":"3.3.09.d"},{"$f":"ListaCriterios!I168","v":"x"},{"$f":"ListaCriterios!J168","v":"Existen acuerdos con los titulares de las parcelas para su mantenimiento o, en su defecto, con administración competente"},{"$f":"ListaCriterios!K168","v":"SI/NO"}]
[{"$f":"ListaCriterios!B169","v":"Infrastructuras y servicios"},{"$f":"ListaCriterios!C169","v":"3.3"},{"$f":"ListaCriterios!D169","v":"Servicios avanzados y/o compartidos"},{"$f":"ListaCriterios!E169","v":"3.3.9"},{"$f":"ListaCriterios!F169","v":"Mantenimiento de parcelas vacías"},{"$f":"ListaCriterios!G169","v":"CALIDAD DEL ESPACIO"},{"$f":"ListaCriterios!H169","v":"3.3.09.e"},{"$f":"ListaCriterios!I169","v":"x"},{"$f":"ListaCriterios!J169","v":"¿Están las parcelas vacías cerradas al acceso al público?"},{"$f":"ListaCriterios!K169","v":"SI/NO"}]
[]
[null,null,null,null,null,null,null,null,{"$f":"E188","v":"Espacios de bienestar (servicios a las personas)"}]
[]
[{"$f":"ListaCriterios!B170","v":"Infrastructuras y servicios"},{"$f":"ListaCriterios!C170","v":"3.3"},{"$f":"ListaCriterios!D170","v":"Servicios avanzados y/o compartidos"},{"$f":"ListaCriterios!E170","v":"3.3.10"},{"$f":"ListaCriterios!F170","v":"Espacios de bienestar (servicios a las personas)"},{"$f":"ListaCriterios!G170","v":"CALIDAD DEL ESPACIO"},{"$f":"ListaCriterios!H170","v":"3.3.10.a"},{"$f":"ListaCriterios!I170","v":"x"},{"$f":"ListaCriterios!J170","v":"¿Existen espacios de bienestar para personas tales como gimnasio, espacios de ocio, fisioterapia…?"},{"$f":"ListaCriterios!K170","v":"SI/NO"}]
[]
[null,null,null,null,null,null,null,null,{"$f":"E192","v":"Bolsa de subproductos/desechería industrial"}]
[]
[{"$f":"ListaCriterios!B171","v":"Infrastructuras y servicios"},{"$f":"ListaCriterios!C171","v":"3.3"},{"$f":"ListaCriterios!D171","v":"Servicios avanzados y/o compartidos"},{"$f":"ListaCriterios!E171","v":"3.3.11"},{"$f":"ListaCriterios!F171","v":"Bolsa de subproductos/desechería industrial"},{"$f":"ListaCriterios!G171","v":"RESIDUOS"},{"$f":"ListaCriterios!H171","v":"3.3.11.a"},{"$f":"ListaCriterios!I171","v":"x"},{"$f":"ListaCriterios!J171","v":"¿Existe bolsa de subproductos?"},{"$f":"ListaCriterios!K171","v":"SI/NO"}]
[{"$f":"ListaCriterios!B172","v":"Infrastructuras y servicios"},{"$f":"ListaCriterios!C172","v":"3.3"},{"$f":"ListaCriterios!D172","v":"Servicios avanzados y/o compartidos"},{"$f":"ListaCriterios!E172","v":"3.3.11"},{"$f":"ListaCriterios!F172","v":"Bolsa de subproductos/desechería industrial"},{"$f":"ListaCriterios!G172","v":"RESIDUOS"},{"$f":"ListaCriterios!H172","v":"3.3.11.b"},{"$f":"ListaCriterios!I172","v":"x"},{"$f":"ListaCriterios!J172","v":"¿Existe scrap-store o similar?"},{"$f":"ListaCriterios!K172","v":"SI/NO"}]
[{"$f":"ListaCriterios!B173","v":"Infrastructuras y servicios"},{"$f":"ListaCriterios!C173","v":"3.3"},{"$f":"ListaCriterios!D173","v":"Servicios avanzados y/o compartidos"},{"$f":"ListaCriterios!E173","v":"3.3.11"},{"$f":"ListaCriterios!F173","v":"Bolsa de subproductos/desechería industrial"},{"$f":"ListaCriterios!G173","v":"RESIDUOS"},{"$f":"ListaCriterios!H173","v":"3.3.11.c"},{"$f":"ListaCriterios!I173","v":"x"},{"$f":"ListaCriterios!J173","v":"¿Existe centro de recogida industrial?"},{"$f":"ListaCriterios!K173","v":"SI/NO"}]
[]
[null,null,null,null,null,null,null,null,{"$f":"E198","v":"Seguridad y emergencias"}]
[]
[{"$f":"ListaCriterios!B174","v":"Infrastructuras y servicios"},{"$f":"ListaCriterios!C174","v":"3.3"},{"$f":"ListaCriterios!D174","v":"Servicios avanzados y/o compartidos"},{"$f":"ListaCriterios!E174","v":"3.3.12"},{"$f":"ListaCriterios!F174","v":"Seguridad y emergencias"},{"$f":"ListaCriterios!G174","v":"SEGURIDAD"},{"$f":"ListaCriterios!H174","v":"3.3.12.a"},{"$f":"ListaCriterios!I174","v":"x"},{"$f":"ListaCriterios!J174","v":"¿El área empresarial cuenta con presencia de fuerzas y cuerpos de seguridad o de servicio de vigilancia privada?"},{"$f":"ListaCriterios!K174","v":"SI/NO"}]
[{"$f":"ListaCriterios!B175","v":"Infrastructuras y servicios"},{"$f":"ListaCriterios!C175","v":"3.3"},{"$f":"ListaCriterios!D175","v":"Servicios avanzados y/o compartidos"},{"$f":"ListaCriterios!E175","v":"3.3.12"},{"$f":"ListaCriterios!F175","v":"Seguridad y emergencias"},{"$f":"ListaCriterios!G175","v":"SEGURIDAD"},{"$f":"ListaCriterios!H175","v":"3.3.12.b"},{"$f":"ListaCriterios!I175","v":"x"},{"$f":"ListaCriterios!J175","v":"¿Se ha comunicado el plan de actuación frente a emergencias a empresas del área y terceros potencialmente afectados sobre su contenido? ¿Se tienen evidencias de estas comunicaciones?"},{"$f":"ListaCriterios!K175","v":"Grad 1-5"}]
[{"$f":"ListaCriterios!B176","v":"Infrastructuras y servicios"},{"$f":"ListaCriterios!C176","v":"3.3"},{"$f":"ListaCriterios!D176","v":"Servicios avanzados y/o compartidos"},{"$f":"ListaCriterios!E176","v":"3.3.12"},{"$f":"ListaCriterios!F176","v":"Seguridad y emergencias"},{"$f":"ListaCriterios!G176","v":"SEGURIDAD"},{"$f":"ListaCriterios!H176","v":"3.3.12.c"},{"$f":"ListaCriterios!I176","v":"x"},{"$f":"ListaCriterios!J176","v":"¿Se han realizado simulacros de puesta en marcha el plan de emergencia en el último año? ¿Se han puesto en marcha las infraestructuras de emergencia? (RECOMENDACIÓN)"},{"$f":"ListaCriterios!K176","v":"SI/NO"}]
[{"$f":"ListaCriterios!B177","v":"Infrastructuras y servicios"},{"$f":"ListaCriterios!C177","v":"3.3"},{"$f":"ListaCriterios!D177","v":"Servicios avanzados y/o compartidos"},{"$f":"ListaCriterios!E177","v":"3.3.12"},{"$f":"ListaCriterios!F177","v":"Seguridad y emergencias"},{"$f":"ListaCriterios!G177","v":"SEGURIDAD"},{"$f":"ListaCriterios!H177","v":"3.3.12.d"},{"$f":"ListaCriterios!I177","v":"x"},{"$f":"ListaCriterios!J177","v":"¿Se tiene un Plan de emergencias en versión actualizada y con los contenidos indicados en el referencial Marca Q?"},{"$f":"ListaCriterios!K177","v":"SI/NO"}]
[{"$f":"ListaCriterios!B178","v":"Infrastructuras y servicios"},{"$f":"ListaCriterios!C178","v":"3.3"},{"$f":"ListaCriterios!D178","v":"Servicios avanzados y/o compartidos"},{"$f":"ListaCriterios!E178","v":"3.3.12"},{"$f":"ListaCriterios!F178","v":"Seguridad y emergencias"},{"$f":"ListaCriterios!G178","v":"SEGURIDAD"},{"$f":"ListaCriterios!H178","v":"3.3.12.e"},{"$f":"ListaCriterios!I178","v":"x"},{"$f":"ListaCriterios!J178","v":"Grado de coordinación de la vigilancia privada y conocimiento del procedimiento de actuación frente a incidentes"},{"$f":"ListaCriterios!K178","v":"Grad 1-5"}]
[{"$f":"ListaCriterios!B179","v":"Infrastructuras y servicios"},{"$f":"ListaCriterios!C179","v":"3.3"},{"$f":"ListaCriterios!D179","v":"Servicios avanzados y/o compartidos"},{"$f":"ListaCriterios!E179","v":"3.3.12"},{"$f":"ListaCriterios!F179","v":"Seguridad y emergencias"},{"$f":"ListaCriterios!G179","v":"SEGURIDAD"},{"$f":"ListaCriterios!H179","v":"3.3.12.f"},{"$f":"ListaCriterios!I179","v":"x"},{"$f":"ListaCriterios!J179","v":"Definición clara de responsabilidades en relación con el plan de actuación ante emergencias vigente"},{"$f":"ListaCriterios!K179","v":"SI/NO"}]
[{"$f":"ListaCriterios!B180","v":"Infrastructuras y servicios"},{"$f":"ListaCriterios!C180","v":"3.3"},{"$f":"ListaCriterios!D180","v":"Servicios avanzados y/o compartidos"},{"$f":"ListaCriterios!E180","v":"3.3.12"},{"$f":"ListaCriterios!F180","v":"Seguridad y emergencias"},{"$f":"ListaCriterios!G180","v":"SEGURIDAD"},{"$f":"ListaCriterios!H180","v":"3.3.12.g"},{"$f":"ListaCriterios!I180","v":"x"},{"$f":"ListaCriterios!J180","v":"Grado de funcionamiento y mantenimiento de las instalaciones de vigilancia"},{"$f":"ListaCriterios!K180","v":"Grad 1-5"}]
[{"$f":"ListaCriterios!B181","v":"Infrastructuras y servicios"},{"$f":"ListaCriterios!C181","v":"3.3"},{"$f":"ListaCriterios!D181","v":"Servicios avanzados y/o compartidos"},{"$f":"ListaCriterios!E181","v":"3.3.12"},{"$f":"ListaCriterios!F181","v":"Seguridad y emergencias"},{"$f":"ListaCriterios!G181","v":"SEGURIDAD"},{"$f":"ListaCriterios!H181","v":"3.3.12.h"},{"$f":"ListaCriterios!I181","v":"x"},{"$f":"ListaCriterios!J181","v":"¿Se realizan simulacros de emergencia con periodicidad adecuada y se analiza la información obtenida para la mejora?"},{"$f":"ListaCriterios!K181","v":"SI/NO"}]
[{"$f":"ListaCriterios!B182","v":"Infrastructuras y servicios"},{"$f":"ListaCriterios!C182","v":"3.3"},{"$f":"ListaCriterios!D182","v":"Servicios avanzados y/o compartidos"},{"$f":"ListaCriterios!E182","v":"3.3.12"},{"$f":"ListaCriterios!F182","v":"Seguridad y emergencias"},{"$f":"ListaCriterios!G182","v":"SEGURIDAD"},{"$f":"ListaCriterios!H182","v":"3.3.12.i"},{"$f":"ListaCriterios!I182","v":"x"},{"$f":"ListaCriterios!J182","v":"¿Existen un servicio central que centralice la gestión de emergencias en el PAE?"},{"$f":"ListaCriterios!K182","v":"SI/NO"}]
[]
[null,null,null,null,null,null,null,null,{"$f":"C218","v":"Servicios básicos"}]
[]
[null,null,null,null,null,null,null,null,{"$f":"E212","v":"Transporte público"}]
[]
[{"$f":"ListaCriterios!B183","v":"Infrastructuras y servicios"},{"$f":"ListaCriterios!C183","v":"3.4"},{"$f":"ListaCriterios!D183","v":"Servicios básicos"},{"$f":"ListaCriterios!E183","v":"3.4.1"},{"$f":"ListaCriterios!F183","v":"Transporte público"},{"$f":"ListaCriterios!G183","v":"MOVILIDAD"},{"$f":"ListaCriterios!H183","v":"3.4.1.b"},{"$f":"ListaCriterios!I183","v":0},{"$f":"ListaCriterios!J183","v":"Grado de proximidad y competitividad del transporte público (llega, frecuencia, rapidez, competitividad…)"},{"$f":"ListaCriterios!K183","v":"Grad 1-5"}]
[]
[null,null,null,null,null,null,null,null,{"$f":"E216","v":"Limpieza vial"}]
[]
[{"$f":"ListaCriterios!B184","v":"Infrastructuras y servicios"},{"$f":"ListaCriterios!C184","v":"3.4"},{"$f":"ListaCriterios!D184","v":"Servicios básicos"},{"$f":"ListaCriterios!E184","v":"3.4.2"},{"$f":"ListaCriterios!F184","v":"Limpieza vial"},{"$f":"ListaCriterios!G184","v":"CALIDAD DEL ESPACIO"},{"$f":"ListaCriterios!H184","v":"3.4.2.a"},{"$f":"ListaCriterios!I184","v":0},{"$f":"ListaCriterios!J184","v":"¿Se tiene contrato (en caso de corresponder la gestión en el área) con la empresa proveedora del servicio de limpieza?"},{"$f":"ListaCriterios!K184","v":"SI/NO"}]
[{"$f":"ListaCriterios!B185","v":"Infrastructuras y servicios"},{"$f":"ListaCriterios!C185","v":"3.4"},{"$f":"ListaCriterios!D185","v":"Servicios básicos"},{"$f":"ListaCriterios!E185","v":"3.4.2"},{"$f":"ListaCriterios!F185","v":"Limpieza vial"},{"$f":"ListaCriterios!G185","v":"CALIDAD DEL ESPACIO"},{"$f":"ListaCriterios!H185","v":"3.4.2.b"},{"$f":"ListaCriterios!I185","v":0},{"$f":"ListaCriterios!J185","v":"¿Existen Informes o propuestas de mejora enviadas a concesionario de limpieza, si las hubiere?"},{"$f":"ListaCriterios!K185","v":"SI/NO"}]
[{"$f":"ListaCriterios!B186","v":"Infrastructuras y servicios"},{"$f":"ListaCriterios!C186","v":"3.4"},{"$f":"ListaCriterios!D186","v":"Servicios básicos"},{"$f":"ListaCriterios!E186","v":"3.4.2"},{"$f":"ListaCriterios!F186","v":"Limpieza vial"},{"$f":"ListaCriterios!G186","v":"CALIDAD DEL ESPACIO"},{"$f":"ListaCriterios!H186","v":"3.4.2.c"},{"$f":"ListaCriterios!I186","v":0},{"$f":"ListaCriterios!J186","v":"Grado de conservación de las zonas verdes dentro del área empresarial"},{"$f":"ListaCriterios!K186","v":"Grad 1-5"}]
[{"$f":"ListaCriterios!B187","v":"Infrastructuras y servicios"},{"$f":"ListaCriterios!C187","v":"3.4"},{"$f":"ListaCriterios!D187","v":"Servicios básicos"},{"$f":"ListaCriterios!E187","v":"3.4.2"},{"$f":"ListaCriterios!F187","v":"Limpieza vial"},{"$f":"ListaCriterios!G187","v":"CALIDAD DEL ESPACIO"},{"$f":"ListaCriterios!H187","v":"3.4.2.d"},{"$f":"ListaCriterios!I187","v":0},{"$f":"ListaCriterios!J187","v":"Grado de limpieza del espacio público del área empresarial"},{"$f":"ListaCriterios!K187","v":"Grad 1-5"}]
[{"$f":"ListaCriterios!B188","v":"Infrastructuras y servicios"},{"$f":"ListaCriterios!C188","v":"3.4"},{"$f":"ListaCriterios!D188","v":"Servicios básicos"},{"$f":"ListaCriterios!E188","v":"3.4.2"},{"$f":"ListaCriterios!F188","v":"Limpieza vial"},{"$f":"ListaCriterios!G188","v":"CALIDAD DEL ESPACIO"},{"$f":"ListaCriterios!H188","v":"3.4.2.e"},{"$f":"ListaCriterios!I188","v":0},{"$f":"ListaCriterios!J188","v":"¿Los períodos de prestación de servicio son adecuados a la tipología del área ya las necesidades de las empresas?"},{"$f":"ListaCriterios!K188","v":"SI/NO"}]

{"sheet":"4.INTEGR AMBIENTAL Y RIESGOS","index":4,"n_rows":54,"n_cols":16,"rows_kept":54,"cut":false,"hidden":false,"merged":[[0,8,0,10]]}
[null,null,null,null,null,null,null,null,{"$f":"A7","v":"Integración ambiental y riesgos"},null,null,"(Ocultar, és automatic)",null,null,"Sí","No"]
[]
[null,null,null,null,null,null,null,null,{"$f":"C7","v":"Contaminación luminosa"}]
[]
[null,null,null,null,null,null,null,null,{"$f":"E7","v":"Alumbrado adaptado"}]
[]
[{"$f":"ListaCriterios!B189","v":"Integración ambiental y riesgos"},{"$f":"ListaCriterios!C189","v":"4.1"},{"$f":"ListaCriterios!D189","v":"Contaminación luminosa"},{"$f":"ListaCriterios!E189","v":"4.1.1"},{"$f":"ListaCriterios!F189","v":"Alumbrado adaptado"},{"$f":"ListaCriterios!G189","v":"CALIDAD DEL ESPACIO"},{"$f":"ListaCriterios!H189","v":"4.1.1.a"},{"$f":"ListaCriterios!I189","v":0},{"$f":"ListaCriterios!J189","v":"Proporción de alumbrado adpatado a normativa (%)"},{"$f":"ListaCriterios!K189","v":"Grad 1-5"},null,false,false]
[{"$f":"ListaCriterios!B190","v":"Integración ambiental y riesgos"},{"$f":"ListaCriterios!C190","v":"4.1"},{"$f":"ListaCriterios!D190","v":"Contaminación luminosa"},{"$f":"ListaCriterios!E190","v":"4.1.1"},{"$f":"ListaCriterios!F190","v":"Alumbrado adaptado"},{"$f":"ListaCriterios!G190","v":"CALIDAD DEL ESPACIO"},{"$f":"ListaCriterios!H190","v":"4.1.1.b"},{"$f":"ListaCriterios!I190","v":0},{"$f":"ListaCriterios!J190","v":"¿Existe mapa de protección frente a la contaminación luminosa (zonas E1, E2, E3, E4) disponible y actualizado?"},{"$f":"ListaCriterios!K190","v":"SI/NO"}]
[]
[null,null,null,null,null,null,null,null,{"$f":"C15","v":"Emisiones atmosféricas"}]
[]
[]
[null,null,null,null,null,null,null,null,{"$f":"E15","v":"Control de emisiones atmosféricas"}]
[]
[{"$f":"ListaCriterios!B191","v":"Integración ambiental y riesgos"},{"$f":"ListaCriterios!C191","v":"4.2"},{"$f":"ListaCriterios!D191","v":"Emisiones atmosféricas"},{"$f":"ListaCriterios!E191","v":"4.2.1"},{"$f":"ListaCriterios!F191","v":"Control de emisiones atmosféricas"},{"$f":"ListaCriterios!G191","v":"ENERGÍA Y CAMBIO CLIMATIC"},{"$f":"ListaCriterios!H191","v":"4.2.1.b"},{"$f":"ListaCriterios!I191","v":"x"},{"$f":"ListaCriterios!J191","v":"¿Existe estación de medida de inmisión de contaminantes atmosféricos?"},{"$f":"ListaCriterios!K191","v":"SI/NO"}]
[{"$f":"ListaCriterios!B192","v":"Integración ambiental y riesgos"},{"$f":"ListaCriterios!C192","v":"4.2"},{"$f":"ListaCriterios!D192","v":"Emisiones atmosféricas"},{"$f":"ListaCriterios!E192","v":"4.2.2"},{"$f":"ListaCriterios!F192","v":"Calidad del aire"},{"$f":"ListaCriterios!G192","v":"ENERGÍA Y CAMBIO CLIMATIC"},{"$f":"ListaCriterios!H192","v":"4.2.2.c"},{"$f":"ListaCriterios!I192","v":"x"},{"$f":"ListaCriterios!J192","v":"¿Existe información de proximidad disponible sobre sobre calidad del aire: PST, NO2, CO, O3?"},{"$f":"ListaCriterios!K192","v":"SI/NO"}]
[]
[null,null,null,null,null,null,null,null,{"$f":"C23","v":"Inundabilidad"}]
[]
[]
[null,null,null,null,null,null,null,null,{"$f":"E23","v":"Afectación por zonas inundables"}]
[]
[{"$f":"ListaCriterios!B193","v":"Integración ambiental y riesgos"},{"$f":"ListaCriterios!C193","v":"4.3"},{"$f":"ListaCriterios!D193","v":"Inundabilidad"},{"$f":"ListaCriterios!E193","v":"4.3.1"},{"$f":"ListaCriterios!F193","v":"Afectación por zonas inundables"},{"$f":"ListaCriterios!G193","v":"SEGURIDAD"},{"$f":"ListaCriterios!H193","v":"4.3.1.a"},{"$f":"ListaCriterios!I193","v":0},{"$f":"ListaCriterios!J193","v":"Proporción de superficie del PAE afectada por riesgo de inundación"},{"$f":"ListaCriterios!K193","v":"Grad 1-5"}]
[{"$f":"ListaCriterios!B194","v":"Integración ambiental y riesgos"},{"$f":"ListaCriterios!C194","v":"4.3"},{"$f":"ListaCriterios!D194","v":"Inundabilidad"},{"$f":"ListaCriterios!E194","v":"4.3.2"},{"$f":"ListaCriterios!F194","v":"Afectación por zonas inundables"},{"$f":"ListaCriterios!G194","v":"SEGURIDAD"},{"$f":"ListaCriterios!H194","v":"4.3.2.b"},{"$f":"ListaCriterios!I194","v":0},{"$f":"ListaCriterios!J194","v":"Grado de adecuación de los elementos de protección contra inundaciones"},{"$f":"ListaCriterios!K194","v":"Grad 1-5"}]
[]
[null,null,null,null,null,null,null,null,{"$f":"C31","v":"Medio natural"}]
[]
[]
[null,null,null,null,null,null,null,null,{"$f":"E31","v":"Integración en el entorno natural"}]
[]
[{"$f":"ListaCriterios!B195","v":"Integración ambiental y riesgos"},{"$f":"ListaCriterios!C195","v":"4.4"},{"$f":"ListaCriterios!D195","v":"Medio natural"},{"$f":"ListaCriterios!E195","v":"4.4.1"},{"$f":"ListaCriterios!F195","v":"Integración en el entorno natural"},{"$f":"ListaCriterios!G195","v":"CALIDAD DEL ESPACIO"},{"$f":"ListaCriterios!H195","v":"4.4.1.a"},{"$f":"ListaCriterios!I195","v":"x"},{"$f":"ListaCriterios!J195","v":"¿Se ha realizado un estudio de necesidad de pases de fauna? En caso de existir o ser necesarios, ¿son adecuados?"},{"$f":"ListaCriterios!K195","v":"SI/NO"}]
[{"$f":"ListaCriterios!B196","v":"Integración ambiental y riesgos"},{"$f":"ListaCriterios!C196","v":"4.4"},{"$f":"ListaCriterios!D196","v":"Medio natural"},{"$f":"ListaCriterios!E196","v":"4.4.1"},{"$f":"ListaCriterios!F196","v":"Integración en el entorno natural"},{"$f":"ListaCriterios!G196","v":"SEGURIDAD"},{"$f":"ListaCriterios!H196","v":"4.4.1.b"},{"$f":"ListaCriterios!I196","v":"x"},{"$f":"ListaCriterios!J196","v":"¿Se mantiene el control de perimetros de protección/franjas por control riesgo incendio forestal?"},{"$f":"ListaCriterios!K196","v":"SI/NO"}]
[{"$f":"ListaCriterios!B197","v":"Integración ambiental y riesgos"},{"$f":"ListaCriterios!C197","v":"4.4"},{"$f":"ListaCriterios!D197","v":"Medio natural"},{"$f":"ListaCriterios!E197","v":"4.4.1"},{"$f":"ListaCriterios!F197","v":"Integración en el entorno natural"},{"$f":"ListaCriterios!G197","v":"CALIDAD DEL ESPACIO"},{"$f":"ListaCriterios!H197","v":"4.4.1.c"},{"$f":"ListaCriterios!I197","v":"x"},{"$f":"ListaCriterios!J197","v":"¿Se han realizado estudios de afectación en la fauna?"},{"$f":"ListaCriterios!K197","v":"SI/NO"}]
[{"$f":"ListaCriterios!B198","v":"Integración ambiental y riesgos"},{"$f":"ListaCriterios!C198","v":"4.4"},{"$f":"ListaCriterios!D198","v":"Medio natural"},{"$f":"ListaCriterios!E198","v":"4.4.1"},{"$f":"ListaCriterios!F198","v":"Integración en el entorno natural"},{"$f":"ListaCriterios!G198","v":"CALIDAD DEL ESPACIO"},{"$f":"ListaCriterios!H198","v":"4.4.1.d"},{"$f":"ListaCriterios!I198","v":"x"},{"$f":"ListaCriterios!J198","v":"¿Existen, en caso de ser necesarias, medidas de protección en fauna (aves nidificantes, protección de zonas especiales, control de ruido, control iluminación, etc.)?"},{"$f":"ListaCriterios!K198","v":"SI/NO"}]
[]
[null,null,null,null,null,null,null,null,{"$f":"C41","v":"Paisaje"}]
[]
[]
[null,null,null,null,null,null,null,null,{"$f":"E41","v":"Grado de calidad del paisaje e integración del PAE"}]
[]
[{"$f":"ListaCriterios!B199","v":"Integración ambiental y riesgos"},{"$f":"ListaCriterios!C199","v":"4.5"},{"$f":"ListaCriterios!D199","v":"Paisaje"},{"$f":"ListaCriterios!E199","v":"4.5.1"},{"$f":"ListaCriterios!F199","v":"Grado de calidad del paisaje e integración del PAE"},{"$f":"ListaCriterios!G199","v":"CALIDAD DEL ESPACIO"},{"$f":"ListaCriterios!H199","v":"4.5.1.a"},{"$f":"ListaCriterios!I199","v":"x"},{"$f":"ListaCriterios!J199","v":"Grado de integración del PAE en el paisaje"},{"$f":"ListaCriterios!K199","v":"Grad 1-5"}]
[{"$f":"ListaCriterios!B200","v":"Integración ambiental y riesgos"},{"$f":"ListaCriterios!C200","v":"4.5"},{"$f":"ListaCriterios!D200","v":"Paisaje"},{"$f":"ListaCriterios!E200","v":"4.5.1"},{"$f":"ListaCriterios!F200","v":"Grado de calidad del paisaje e integración del PAE"},{"$f":"ListaCriterios!G200","v":"CALIDAD DEL ESPACIO"},{"$f":"ListaCriterios!H200","v":"4.5.1.b"},{"$f":"ListaCriterios!I200","v":"x"},{"$f":"ListaCriterios!J200","v":"¿Nivel de adecuación del PAE para permitir el disfrute del paisaje?"},{"$f":"ListaCriterios!K200","v":"Grad 1-5"}]
[{"$f":"ListaCriterios!B201","v":"Integración ambiental y riesgos"},{"$f":"ListaCriterios!C201","v":"4.5"},{"$f":"ListaCriterios!D201","v":"Paisaje"},{"$f":"ListaCriterios!E201","v":"4.5.1"},{"$f":"ListaCriterios!F201","v":"Grado de calidad del paisaje e integración del PAE"},{"$f":"ListaCriterios!G201","v":"CALIDAD DEL ESPACIO"},{"$f":"ListaCriterios!H201","v":"4.5.1.c"},{"$f":"ListaCriterios!I201","v":"x"},{"$f":"ListaCriterios!J201","v":"¿Se dispone de información sobre el Patrimonio industrial/cultural, de sus valores y las necesidades de preservación (en su caso)?"},{"$f":"ListaCriterios!K201","v":"SI/NO"}]
[{"$f":"ListaCriterios!B202","v":"Integración ambiental y riesgos"},{"$f":"ListaCriterios!C202","v":"4.5"},{"$f":"ListaCriterios!D202","v":"Paisaje"},{"$f":"ListaCriterios!E202","v":"4.5.1"},{"$f":"ListaCriterios!F202","v":"Grado de calidad del paisaje e integración del PAE"},{"$f":"ListaCriterios!G202","v":"CALIDAD DEL ESPACIO"},{"$f":"ListaCriterios!H202","v":"4.5.1.d"},{"$f":"ListaCriterios!I202","v":0},{"$f":"ListaCriterios!J202","v":"¿Se ha realizado alguna gestión por el mantenimiento del patrimonio industrial/cultural?"},{"$f":"ListaCriterios!K202","v":"SI/NO"}]
[]
[null,null,null,null,null,null,null,null,{"$f":"C51","v":"Ruido"}]
[]
[]
[null,null,null,null,null,null,null,null,{"$f":"E51","v":"Protección contra el ruido"}]
[]
[{"$f":"ListaCriterios!B203","v":"Integración ambiental y riesgos"},{"$f":"ListaCriterios!C203","v":"4.6"},{"$f":"ListaCriterios!D203","v":"Ruido"},{"$f":"ListaCriterios!E203","v":"4.6.1"},{"$f":"ListaCriterios!F203","v":"Protección contra el ruido"},{"$f":"ListaCriterios!G203","v":"CALIDAD DEL ESPACIO"},{"$f":"ListaCriterios!H203","v":"4.6.1.a"},{"$f":"ListaCriterios!I203","v":0},{"$f":"ListaCriterios!J203","v":"¿Existe mapa de zonificación acústica actualizado y disponible?"},{"$f":"ListaCriterios!K203","v":"SI/NO"}]
[{"$f":"ListaCriterios!B204","v":"Integración ambiental y riesgos"},{"$f":"ListaCriterios!C204","v":"4.6"},{"$f":"ListaCriterios!D204","v":"Ruido"},{"$f":"ListaCriterios!E204","v":"4.6.1"},{"$f":"ListaCriterios!F204","v":"Protección contra el ruido"},{"$f":"ListaCriterios!G204","v":"CALIDAD DEL ESPACIO"},{"$f":"ListaCriterios!H204","v":"4.6.1.b"},{"$f":"ListaCriterios!I204","v":0},{"$f":"ListaCriterios!J204","v":"En caso necesario, ¿existen pantallas acústicas o similares para la protección contra el ruido?"},{"$f":"ListaCriterios!K204","v":"SI/NO"}]
[{"$f":"ListaCriterios!B205","v":"Integración ambiental y riesgos"},{"$f":"ListaCriterios!C205","v":"4.6"},{"$f":"ListaCriterios!D205","v":"Ruido"},{"$f":"ListaCriterios!E205","v":"4.6.1"},{"$f":"ListaCriterios!F205","v":"Protección contra el ruido"},{"$f":"ListaCriterios!G205","v":"CALIDAD DEL ESPACIO"},{"$f":"ListaCriterios!H205","v":"4.6.1.c"},{"$f":"ListaCriterios!I205","v":"x"},{"$f":"ListaCriterios!J205","v":"¿La vialidad está construida con asfalto sonorreductor o medidas equivalentes?"},{"$f":"ListaCriterios!K205","v":"SI/NO"}]
[{"$f":"ListaCriterios!B206","v":"Integración ambiental y riesgos"},{"$f":"ListaCriterios!C206","v":"4.6"},{"$f":"ListaCriterios!D206","v":"Ruido"},{"$f":"ListaCriterios!E206","v":"4.6.1"},{"$f":"ListaCriterios!F206","v":"Protección contra el ruido"},{"$f":"ListaCriterios!G206","v":"CALIDAD DEL ESPACIO"},{"$f":"ListaCriterios!H206","v":"4.6.1.d"},{"$f":"ListaCriterios!I206","v":"x"},{"$f":"ListaCriterios!J206","v":"¿Se realizan controles de ruido o existe algún tipo de servicio por su control?"},{"$f":"ListaCriterios!K206","v":"SI/NO"}]

{"sheet":"5.URBANISMO","index":5,"n_rows":44,"n_cols":16,"rows_kept":44,"cut":false,"hidden":false,"merged":[[0,8,0,10]]}
[null,null,null,null,null,null,null,null,{"$f":"A7","v":"Urbanismo"},null,null,"(Ocultar, és automatic)",null,null,"Sí","No"]
[]
[null,null,null,null,null,null,null,null,{"$f":"C7","v":"Características de las parcelas"}]
[]
[null,null,null,null,null,null,null,null,{"$f":"E7","v":"Grado de ocupación de los PAE"}]
[]
[{"$f":"ListaCriterios!B207","v":"Urbanismo"},{"$f":"ListaCriterios!C207","v":"5.1"},{"$f":"ListaCriterios!D207","v":"Características de las parcelas"},{"$f":"ListaCriterios!E207","v":"5.1.1"},{"$f":"ListaCriterios!F207","v":"Grado de ocupación de los PAE"},{"$f":"ListaCriterios!G207","v":"SUELO"},{"$f":"ListaCriterios!H207","v":"5.1.1.a"},{"$f":"ListaCriterios!I207","v":0},{"$f":"ListaCriterios!J207","v":"Grado de ocupación de los PAE (%)"},{"$f":"ListaCriterios!K207","v":"Grad 1-5"},null,false,false]
[]
[null,null,null,null,null,null,null,null,{"$f":"E11","v":"Titularidad de las parcelas vacantes y grado de comercialización"}]
[]
[{"$f":"ListaCriterios!B208","v":"Urbanismo"},{"$f":"ListaCriterios!C208","v":"5.1"},{"$f":"ListaCriterios!D208","v":"Características de las parcelas"},{"$f":"ListaCriterios!E208","v":"5.1.2"},{"$f":"ListaCriterios!F208","v":"Titularidad de las parcelas vacantes y grado de comercialización"},{"$f":"ListaCriterios!G208","v":"SUELO"},{"$f":"ListaCriterios!H208","v":"5.1.2.a"},{"$f":"ListaCriterios!I208","v":0},{"$f":"ListaCriterios!J208","v":"Titularidad del parque. vacantes y grado de comercialización"},{"$f":"ListaCriterios!K208","v":"Grad 1-5"}]
[]
[null,null,null,null,null,null,null,null,{"$f":"E15","v":"Tipología de las parcelas"}]
[]
[{"$f":"ListaCriterios!B209","v":"Urbanismo"},{"$f":"ListaCriterios!C209","v":"5.1"},{"$f":"ListaCriterios!D209","v":"Características de las parcelas"},{"$f":"ListaCriterios!E209","v":"5.1.3"},{"$f":"ListaCriterios!F209","v":"Tipología de las parcelas"},{"$f":"ListaCriterios!G209","v":"SUELO"},{"$f":"ListaCriterios!H209","v":"5.1.3.a"},{"$f":"ListaCriterios!I209","v":0},{"$f":"ListaCriterios!J209","v":"Tipología de las parcelas según dimensiones (variabilidad, disponibilidad y flexibilidad de modificación)"},{"$f":"ListaCriterios!K209","v":"Grad 1-5"}]
[]
[null,null,null,null,null,null,null,null,{"$f":"E19","v":"Capacidad de expansión de implantaciones actuales"}]
[]
[{"$f":"ListaCriterios!B210","v":"Urbanismo"},{"$f":"ListaCriterios!C210","v":"5.1"},{"$f":"ListaCriterios!D210","v":"Características de las parcelas"},{"$f":"ListaCriterios!E210","v":"5.1.4"},{"$f":"ListaCriterios!F210","v":"Capacidad de expansión de implantaciones actuales"},{"$f":"ListaCriterios!G210","v":"SUELO"},{"$f":"ListaCriterios!H210","v":"5.1.4.a"},{"$f":"ListaCriterios!I210","v":0},{"$f":"ListaCriterios!J210","v":"Capacidad de expansión de las actividades actuales"},{"$f":"ListaCriterios!K210","v":"Grad 1-5"}]
[]
[null,null,null,null,null,null,null,null,{"$f":"E23","v":"Tipología de las edificaciones"}]
[]
[{"$f":"ListaCriterios!B211","v":"Urbanismo"},{"$f":"ListaCriterios!C211","v":"5.1"},{"$f":"ListaCriterios!D211","v":"Características de las parcelas"},{"$f":"ListaCriterios!E211","v":"5.1.5"},{"$f":"ListaCriterios!F211","v":"Tipología de las edificaciones"},{"$f":"ListaCriterios!G211","v":"SUELO"},{"$f":"ListaCriterios!H211","v":"5.1.5.a"},{"$f":"ListaCriterios!I211","v":0},{"$f":"ListaCriterios!J211","v":"Edad promedio de las edificaciones actuales y necesidad de renovación"},{"$f":"ListaCriterios!K211","v":"Grad 1-5"}]
[]
[null,null,null,null,null,null,null,null,{"$f":"C30","v":"Emplazamiento"}]
[]
[]
[null,null,null,null,null,null,null,null,{"$f":"E30","v":"Acceso desde Áreas Residenciales"}]
[]
[{"$f":"ListaCriterios!B212","v":"Urbanismo"},{"$f":"ListaCriterios!C212","v":"5.2"},{"$f":"ListaCriterios!D212","v":"Emplazamiento"},{"$f":"ListaCriterios!E212","v":"5.2.1"},{"$f":"ListaCriterios!F212","v":"Acceso desde Áreas Residenciales"},{"$f":"ListaCriterios!G212","v":"MOVILIDAD"},{"$f":"ListaCriterios!H212","v":"5.2.1.a"},{"$f":"ListaCriterios!I212","v":0},{"$f":"ListaCriterios!J212","v":"Grado de proximidad a Áreas Residenciales"},{"$f":"ListaCriterios!K212","v":"Grad 1-5"}]
[{"$f":"ListaCriterios!B213","v":"Urbanismo"},{"$f":"ListaCriterios!C213","v":"5.2"},{"$f":"ListaCriterios!D213","v":"Emplazamiento"},{"$f":"ListaCriterios!E213","v":"5.2.1"},{"$f":"ListaCriterios!F213","v":"Acceso desde Áreas Industriales"},{"$f":"ListaCriterios!G213","v":"MOVILIDAD"},{"$f":"ListaCriterios!H213","v":"5.2.1.b"},{"$f":"ListaCriterios!I213","v":0},{"$f":"ListaCriterios!J213","v":"Grado de proximidad a otras áreas industriales"},{"$f":"ListaCriterios!K213","v":"Grad 1-5"}]
[]
[null,null,null,null,null,null,null,null,{"$f":"E35","v":"Estado favorable de la tramitación urbanística"}]
[]
[{"$f":"ListaCriterios!B214","v":"Urbanismo"},{"$f":"ListaCriterios!C214","v":"5.2"},{"$f":"ListaCriterios!D214","v":"Emplazamiento"},{"$f":"ListaCriterios!E214","v":"5.2.2"},{"$f":"ListaCriterios!F214","v":"Estado favorable de la tramitación urbanística"},{"$f":"ListaCriterios!G214","v":"SUELO"},{"$f":"ListaCriterios!H214","v":"5.2.2.a"},{"$f":"ListaCriterios!I214","v":0},{"$f":"ListaCriterios!J214","v":"Estado del planeamiento y su tramitación"},{"$f":"ListaCriterios!K214","v":"Grad 1-5"}]
[]
[null,null,null,null,null,null,null,null,{"$f":"E39","v":"Capacidad de ampliación"}]
[]
[{"$f":"ListaCriterios!B215","v":"Urbanismo"},{"$f":"ListaCriterios!C215","v":"5.2"},{"$f":"ListaCriterios!D215","v":"Emplazamiento"},{"$f":"ListaCriterios!E215","v":"5.2.3"},{"$f":"ListaCriterios!F215","v":"Capacidad de ampliación"},{"$f":"ListaCriterios!G215","v":"SUELO"},{"$f":"ListaCriterios!H215","v":"5.2.3.a"},{"$f":"ListaCriterios!I215","v":0},{"$f":"ListaCriterios!J215","v":"¿El PAE tiene posibilidades de ampliación?"},{"$f":"ListaCriterios!K215","v":"SI/NO"}]
[]
[null,null,null,null,null,null,null,null,{"$f":"E43","v":"Equipamientos, Zonas verdes y Servicios Técnicos"}]
[]
[{"$f":"ListaCriterios!B216","v":"Urbanismo"},{"$f":"ListaCriterios!C216","v":"5.2"},{"$f":"ListaCriterios!D216","v":"Emplazamiento"},{"$f":"ListaCriterios!E216","v":"5.2.4"},{"$f":"ListaCriterios!F216","v":"Equipamientos, Zonas verdes y Servicios Técnicos"},{"$f":"ListaCriterios!G216","v":"SUELO"},{"$f":"ListaCriterios!H216","v":"5.2.4.a"},{"$f":"ListaCriterios!I216","v":0},{"$f":"ListaCriterios!J216","v":"¿Se han cumplido y todavía están disponibles las reservas urbanísticas por equipamientos y servicios técnicos?"},{"$f":"ListaCriterios!K216","v":"SI/NO"}]
[{"$f":"ListaCriterios!B217","v":"Urbanismo"},{"$f":"ListaCriterios!C217","v":"5.2"},{"$f":"ListaCriterios!D217","v":"Emplazamiento"},{"$f":"ListaCriterios!E217","v":"5.2.5"},{"$f":"ListaCriterios!F217","v":"Equipamientos, Zonas verdes y Servicios Técnicos"},{"$f":"ListaCriterios!G217","v":"SUELO"},{"$f":"ListaCriterios!H217","v":"5.2.5.b"},{"$f":"ListaCriterios!I217","v":0},{"$f":"ListaCriterios!J217","v":"Grado de adecuación de Zonas Verdes y de Equipamientos previstos por el planteamiento urbanístico"},{"$f":"ListaCriterios!K217","v":"Grad 1-5"}]

{"sheet":"GRAFICOS","index":6,"n_rows":5,"n_cols":2,"rows_kept":5,"cut":false,"hidden":true,"merged":[[1,0,1,2]]}
[]
["PRESENTACIÓN DE RESULTADOS"]
[]
["POLÍGONO:",{"$f":"PORTADA!B4","v":0}]
["MUNICIPIO:",{"$f":"PORTADA!B5","v":0}]

{"sheet":"INFORME MEJORAS","index":7,"n_rows":69,"n_cols":3,"rows_kept":69,"cut":false,"hidden":true,"merged":[[1,0,1,2],[6,0,6,2]]}
[]
["PRESENTACIÓN DE MEJORAS PRIORITARIAS EN ASPECTOS DE ECOEFICIENCIA"]
[]
["POLÍGONO:",{"$f":"PORTADA!B4","v":0}]
["MUNICIPIO:",{"$f":"PORTADA!B5","v":0}]
[]
[]
[]
[]
[]
[]
[{"$f":"IF(C12=0,'CALCULOS_din Millores'!A8,\"\")","v":"Aspectos sociales y comunicación"},{"$f":"IF(C12=0,\"\",\"- \"&'CALCULOS_din Millores'!A8)","v":""},{"$f":"'CALCULOS_din Millores'!D8","v":0}]
[{"$f":"IF(C13=0,'CALCULOS_din Millores'!A9,\"\")","v":""},{"$f":"IF(C13=0,\"\",\"- \"&'CALCULOS_din Millores'!A9)","v":"- Crear un procedimiento para recoger y analizar datos de necesidades o demandas de las empresas y entidades del PAE"},{"$f":"'CALCULOS_din Millores'!D9","v":15}]
[{"$f":"IF(C14=0,'CALCULOS_din Millores'!A10,\"\")","v":""},{"$f":"IF(C14=0,\"\",\"- \"&'CALCULOS_din Millores'!A10)","v":"- Crear o contratar una plataforma de teleformación similar para ofrecer cursos, seminarios, etc. A trabajadores y empresarios"},{"$f":"'CALCULOS_din Millores'!D10","v":15}]
[{"$f":"IF(C15=0,'CALCULOS_din Millores'!A11,\"\")","v":""},{"$f":"IF(C15=0,\"\",\"- \"&'CALCULOS_din Millores'!A11)","v":"- Registrar las apariciones de la asociación o equivalente y de sus empresas en los medios de comunicación"},{"$f":"'CALCULOS_din Millores'!D11","v":15}]
[{"$f":"IF(C16=0,'CALCULOS_din Millores'!A12,\"\")","v":""},{"$f":"IF(C16=0,\"\",\"- \"&'CALCULOS_din Millores'!A12)","v":"- Promover y/o participar en jornadas o proyectos con objetivos sociales y/o ambientales"},{"$f":"'CALCULOS_din Millores'!D12","v":15}]
[{"$f":"IF(C17=0,'CALCULOS_din Millores'!A13,\"\")","v":"Gestión de los recursos"},{"$f":"IF(C17=0,\"\",\"- \"&'CALCULOS_din Millores'!A13)","v":""},{"$f":"'CALCULOS_din Millores'!D13","v":0}]
[{"$f":"IF(C18=0,'CALCULOS_din Millores'!A14,\"\")","v":""},{"$f":"IF(C18=0,\"\",\"- \"&'CALCULOS_din Millores'!A14)","v":"- Obtener datos de consumo eléctrico a las empresas con el máximo nivel de detalle y actualización, avanzando hacia la figura del gestor energético."},{"$f":"'CALCULOS_din Millores'!D14","v":15}]
[{"$f":"IF(C19=0,'CALCULOS_din Millores'!A15,\"\")","v":""},{"$f":"IF(C19=0,\"\",\"- \"&'CALCULOS_din Millores'!A15)","v":"- Obtener datos de consumo térmico las empresas con el máximo nivel de detalle y actualización, avanzando hacia la figura del gestor energético."},{"$f":"'CALCULOS_din Millores'!D15","v":15}]
[{"$f":"IF(C20=0,'CALCULOS_din Millores'!A16,\"\")","v":""},{"$f":"IF(C20=0,\"\",\"- \"&'CALCULOS_din Millores'!A16)","v":"- Disponer de los datos de producción de energías renovables en el PAE"},{"$f":"'CALCULOS_din Millores'!D16","v":15}]
[{"$f":"IF(C21=0,'CALCULOS_din Millores'!A17,\"\")","v":""},{"$f":"IF(C21=0,\"\",\"- \"&'CALCULOS_din Millores'!A17)","v":"- Disponer de infraestructuras de producción de energía renovable."},{"$f":"'CALCULOS_din Millores'!D17","v":15}]
[{"$f":"IF(C22=0,'CALCULOS_din Millores'!A18,\"\")","v":""},{"$f":"IF(C22=0,\"\",\"- \"&'CALCULOS_din Millores'!A18)","v":"- Fomentar y/o participar en una comunidad energética local que incorpore a empresas del PAE"},{"$f":"'CALCULOS_din Millores'!D18","v":15}]
[{"$f":"IF(C23=0,'CALCULOS_din Millores'!A19,\"\")","v":""},{"$f":"IF(C23=0,\"\",\"- \"&'CALCULOS_din Millores'!A19)","v":"- Elaborar un estudio del potencial de producción de energía solar fotovoltaica/térmica en el PAE"},{"$f":"'CALCULOS_din Millores'!D19","v":15}]
[{"$f":"IF(C24=0,'CALCULOS_din Millores'!A20,\"\")","v":""},{"$f":"IF(C24=0,\"\",\"- \"&'CALCULOS_din Millores'!A20)","v":"- Disponer de información sobre el potencial de producción eólica y/o registros o estacion de medida viento."},{"$f":"'CALCULOS_din Millores'!D20","v":15}]
[{"$f":"IF(C25=0,'CALCULOS_din Millores'!A21,\"\")","v":""},{"$f":"IF(C25=0,\"\",\"- \"&'CALCULOS_din Millores'!A21)","v":"- Realizar estudios o iniciar un servicio para el fomento de la eficiencia energética en las empresas."},{"$f":"'CALCULOS_din Millores'!D21","v":15}]
[{"$f":"IF(C26=0,'CALCULOS_din Millores'!A22,\"\")","v":""},{"$f":"IF(C26=0,\"\",\"- \"&'CALCULOS_din Millores'!A22)","v":"- Ofrecer a las empresas un sistema de compensación de emisiones, preferiblemente con proyectos locales"},{"$f":"'CALCULOS_din Millores'!D22","v":15}]
[{"$f":"IF(C27=0,'CALCULOS_din Millores'!A23,\"\")","v":""},{"$f":"IF(C27=0,\"\",\"- \"&'CALCULOS_din Millores'!A23)","v":"- Compensar sus emisiones relativas a las actividades de gestión del PAE"},{"$f":"'CALCULOS_din Millores'!D23","v":15}]
[{"$f":"IF(C28=0,'CALCULOS_din Millores'!A24,\"\")","v":""},{"$f":"IF(C28=0,\"\",\"- \"&'CALCULOS_din Millores'!A24)","v":"- Solicitar al ARC (Generalitat de Catalunya) y obtener los datos de generación de residuos de las empresas del PAE"},{"$f":"'CALCULOS_din Millores'!D24","v":15}]
[{"$f":"IF(C29=0,'CALCULOS_din Millores'!A25,\"\")","v":""},{"$f":"IF(C29=0,\"\",\"- \"&'CALCULOS_din Millores'!A25)","v":"- Disponer de los datos de residuos que realmente se recuperen."},{"$f":"'CALCULOS_din Millores'!D25","v":15}]
[{"$f":"IF(C30=0,'CALCULOS_din Millores'!A26,\"\")","v":"Infrastructuras y servicios"},{"$f":"IF(C30=0,\"\",\"- \"&'CALCULOS_din Millores'!A26)","v":""},{"$f":"'CALCULOS_din Millores'!D26","v":0}]
[{"$f":"IF(C31=0,'CALCULOS_din Millores'!A27,\"\")","v":""},{"$f":"IF(C31=0,\"\",\"- \"&'CALCULOS_din Millores'!A27)","v":"- Crear una central de producción de energía renovable, de gestión pública o participada por la asociación"},{"$f":"'CALCULOS_din Millores'!D27","v":15}]
[{"$f":"IF(C32=0,'CALCULOS_din Millores'!A28,\"\")","v":""},{"$f":"IF(C32=0,\"\",\"- \"&'CALCULOS_din Millores'!A28)","v":"- Fomentar y/o participar en infraestructuras de gestión energética como baterías industriales, smart grids, etc."},{"$f":"'CALCULOS_din Millores'!D28","v":15}]
[{"$f":"IF(C33=0,'CALCULOS_din Millores'!A29,\"\")","v":""},{"$f":"IF(C33=0,\"\",\"- \"&'CALCULOS_din Millores'!A29)","v":"- Fomentar y/o participar en la creación de redes de producción de calor"},{"$f":"'CALCULOS_din Millores'!D29","v":15}]
[{"$f":"IF(C34=0,'CALCULOS_din Millores'!A30,\"\")","v":""},{"$f":"IF(C34=0,\"\",\"- \"&'CALCULOS_din Millores'!A30)","v":"- Fomentar y/o participar en la creación de redes de producción de frío"},{"$f":"'CALCULOS_din Millores'!D30","v":15}]
[{"$f":"IF(C35=0,'CALCULOS_din Millores'!A31,\"\")","v":""},{"$f":"IF(C35=0,\"\",\"- \"&'CALCULOS_din Millores'!A31)","v":"- Disponer o realizar reservas de espacio de zanjas por redes, si no se dispone de ellas"},{"$f":"'CALCULOS_din Millores'!D31","v":15}]
[{"$f":"IF(C36=0,'CALCULOS_din Millores'!A32,\"\")","v":""},{"$f":"IF(C36=0,\"\",\"- \"&'CALCULOS_din Millores'!A32)","v":"- Realizar un estudio del potencial de redes de calor/frío en el ámbito del PAE"},{"$f":"'CALCULOS_din Millores'!D32","v":15}]
[{"$f":"IF(C37=0,'CALCULOS_din Millores'!A33,\"\")","v":""},{"$f":"IF(C37=0,\"\",\"- \"&'CALCULOS_din Millores'!A33)","v":"- Instalar y/o fomentar la instalación de puntos de recarga por vehículos eléctricos"},{"$f":"'CALCULOS_din Millores'!D33","v":15}]
[{"$f":"IF(C38=0,'CALCULOS_din Millores'!A34,\"\")","v":""},{"$f":"IF(C38=0,\"\",\"- \"&'CALCULOS_din Millores'!A34)","v":"- Instalar y/o fomentar la instalación de una fotolinera (zona de recarga rápida de vehículos eléctricos)"},{"$f":"'CALCULOS_din Millores'!D34","v":15}]
[{"$f":"IF(C39=0,'CALCULOS_din Millores'!A35,\"\")","v":""},{"$f":"IF(C39=0,\"\",\"- \"&'CALCULOS_din Millores'!A35)","v":"- Nuevos carreras y carreteras y reparaciones con materiales con etiqueta y certificaciones de sostenibilidad"},{"$f":"'CALCULOS_din Millores'!D35","v":15}]
[{"$f":"IF(C40=0,'CALCULOS_din Millores'!A36,\"\")","v":""},{"$f":"IF(C40=0,\"\",\"- \"&'CALCULOS_din Millores'!A36)","v":"- Definir políticas de aparcamiento de vehículos que fomenten la movilidad sostenible dentro del PAE y para acceder a ellas desde las zonas más urbanas"},{"$f":"'CALCULOS_din Millores'!D36","v":15}]
[{"$f":"IF(C41=0,'CALCULOS_din Millores'!A37,\"\")","v":""},{"$f":"IF(C41=0,\"\",\"- \"&'CALCULOS_din Millores'!A37)","v":"- Adecuar recorridos seguros y agradables para fomentar el acceso a pie, bicicleta o similar"},{"$f":"'CALCULOS_din Millores'!D37","v":15}]
[{"$f":"IF(C42=0,'CALCULOS_din Millores'!A38,\"\")","v":""},{"$f":"IF(C42=0,\"\",\"- \"&'CALCULOS_din Millores'!A38)","v":"- Fomentar la cobertura móvil de alta velocidad, preferiblemente 5G, en todo el PAE"},{"$f":"'CALCULOS_din Millores'!D38","v":15}]
[{"$f":"IF(C43=0,'CALCULOS_din Millores'!A39,\"\")","v":""},{"$f":"IF(C43=0,\"\",\"- \"&'CALCULOS_din Millores'!A39)","v":"- Ofrecer un servicio de gestión energética y/o ambiental"},{"$f":"'CALCULOS_din Millores'!D39","v":15}]
[{"$f":"IF(C44=0,'CALCULOS_din Millores'!A40,\"\")","v":""},{"$f":"IF(C44=0,\"\",\"- \"&'CALCULOS_din Millores'!A40)","v":"- Poner en marcha o impulsar un servicio de vehículos compartidos (Carsharing, bicicletas compartidas, motocicletas eléctricas, patinetes…)"},{"$f":"'CALCULOS_din Millores'!D40","v":15}]
[{"$f":"IF(C45=0,'CALCULOS_din Millores'!A41,\"\")","v":""},{"$f":"IF(C45=0,\"\",\"- \"&'CALCULOS_din Millores'!A41)","v":"- Ofrecer un servicio agregado o mancomunado de mensajería"},{"$f":"'CALCULOS_din Millores'!D41","v":15}]
[{"$f":"IF(C46=0,'CALCULOS_din Millores'!A42,\"\")","v":""},{"$f":"IF(C46=0,\"\",\"- \"&'CALCULOS_din Millores'!A42)","v":"- Impulsar y/o fomentar servicios logísticos compartidos o integrados"},{"$f":"'CALCULOS_din Millores'!D42","v":15}]
[{"$f":"IF(C47=0,'CALCULOS_din Millores'!A43,\"\")","v":""},{"$f":"IF(C47=0,\"\",\"- \"&'CALCULOS_din Millores'!A43)","v":"- Registrar las actuaciones de mantenimiento de parcelas relacionadas con la limpieza, malas hierbas, limpieza de vertidos incontrolados de residuos, etc"},{"$f":"'CALCULOS_din Millores'!D43","v":15}]
[{"$f":"IF(C48=0,'CALCULOS_din Millores'!A44,\"\")","v":""},{"$f":"IF(C48=0,\"\",\"- \"&'CALCULOS_din Millores'!A44)","v":"- Velar por un correcto mantenimiento de las parcelas vacías por una mejora de la imagen, seguridad, evitar plagas, etc."},{"$f":"'CALCULOS_din Millores'!D44","v":15}]
[{"$f":"IF(C49=0,'CALCULOS_din Millores'!A45,\"\")","v":""},{"$f":"IF(C49=0,\"\",\"- \"&'CALCULOS_din Millores'!A45)","v":"- Crear acuerdos con los titulares de parcelas para su mantenimiento"},{"$f":"'CALCULOS_din Millores'!D45","v":15}]
[{"$f":"IF(C50=0,'CALCULOS_din Millores'!A46,\"\")","v":""},{"$f":"IF(C50=0,\"\",\"- \"&'CALCULOS_din Millores'!A46)","v":"- Velar por que las parcelas vacías estén cerradas al público"},{"$f":"'CALCULOS_din Millores'!D46","v":15}]
[{"$f":"IF(C51=0,'CALCULOS_din Millores'!A47,\"\")","v":""},{"$f":"IF(C51=0,\"\",\"- \"&'CALCULOS_din Millores'!A47)","v":"- Promoción de espacios y servicios de bienestar por las personas (pensado por trabajadores y familiares), como espacios de ocio, gimnasio, fisioterapia, etc."},{"$f":"'CALCULOS_din Millores'!D47","v":15}]
[{"$f":"IF(C52=0,'CALCULOS_din Millores'!A48,\"\")","v":""},{"$f":"IF(C52=0,\"\",\"- \"&'CALCULOS_din Millores'!A48)","v":"- Crear, impulsar o inscribirse en un servicio de bolsa de subproductos y recursos industriales"},{"$f":"'CALCULOS_din Millores'!D48","v":15}]
[{"$f":"IF(C53=0,'CALCULOS_din Millores'!A49,\"\")","v":""},{"$f":"IF(C53=0,\"\",\"- \"&'CALCULOS_din Millores'!A49)","v":"- Crear, impulsar o inscribirse a un servicio de Punto verde industrial"},{"$f":"'CALCULOS_din Millores'!D49","v":15}]
[{"$f":"IF(C54=0,'CALCULOS_din Millores'!A50,\"\")","v":""},{"$f":"IF(C54=0,\"\",\"- \"&'CALCULOS_din Millores'!A50)","v":"- Elaborar y mantener un Plan de Emergencias del PAE y realizar las correspondientes comunicaciones a las empresas"},{"$f":"'CALCULOS_din Millores'!D50","v":30}]
[{"$f":"IF(C55=0,'CALCULOS_din Millores'!A51,\"\")","v":""},{"$f":"IF(C55=0,\"\",\"- \"&'CALCULOS_din Millores'!A51)","v":"- Realizar la correspondiente formación y coordinación con los responsables de la vigilancia privada (en su caso), protección civil, policía local, etc. En relación a posibles emergencias en el PAE"},{"$f":"'CALCULOS_din Millores'!D51","v":15}]
[{"$f":"IF(C56=0,'CALCULOS_din Millores'!A52,\"\")","v":""},{"$f":"IF(C56=0,\"\",\"- \"&'CALCULOS_din Millores'!A52)","v":"- Definir claramente las responsabilidades ante una emergencia en el PAE (normalmente, definidas en el Plan de Emergencia)"},{"$f":"'CALCULOS_din Millores'!D52","v":15}]
[{"$f":"IF(C57=0,'CALCULOS_din Millores'!A53,\"\")","v":""},{"$f":"IF(C57=0,\"\",\"- \"&'CALCULOS_din Millores'!A53)","v":"- Disponer de elementos técnicos para la vigilancia del PAE en buen estado de funcionamiento y mantenimiento (p.ej. pilones por control de tráfico, videovigilancia, iluminación de seguridad, radio…)"},{"$f":"'CALCULOS_din Millores'!D53","v":15}]
[{"$f":"IF(C58=0,'CALCULOS_din Millores'!A54,\"\")","v":""},{"$f":"IF(C58=0,\"\",\"- \"&'CALCULOS_din Millores'!A54)","v":"- Realizar simulacros de Emergencias y analizar sus resultados para mejorar el Plan de Emergencia"},{"$f":"'CALCULOS_din Millores'!D54","v":15}]
[{"$f":"IF(C59=0,'CALCULOS_din Millores'!A55,\"\")","v":""},{"$f":"IF(C59=0,\"\",\"- \"&'CALCULOS_din Millores'!A55)","v":"- Disponer de un centro, servicio o responsable que centralice la gestión de emergencias en el PAE"},{"$f":"'CALCULOS_din Millores'!D55","v":15}]
[{"$f":"IF(C60=0,'CALCULOS_din Millores'!A56,\"\")","v":"Integración ambiental y riesgos"},{"$f":"IF(C60=0,\"\",\"- \"&'CALCULOS_din Millores'!A56)","v":""},{"$f":"'CALCULOS_din Millores'!D56","v":0}]
[{"$f":"IF(C61=0,'CALCULOS_din Millores'!A57,\"\")","v":""},{"$f":"IF(C61=0,\"\",\"- \"&'CALCULOS_din Millores'!A57)","v":"- Disponer de una estación de medida de inmisión de contaminantes atmosféricos (CO, PM10, Nox, SO2, etc)"},{"$f":"'CALCULOS_din Millores'!D57","v":15}]
[{"$f":"IF(C62=0,'CALCULOS_din Millores'!A58,\"\")","v":""},{"$f":"IF(C62=0,\"\",\"- \"&'CALCULOS_din Millores'!A58)","v":"- Evaluar y la necesidad y, en su caso, crear pasos de fauna para garantizar la conectividad ecológica"},{"$f":"'CALCULOS_din Millores'!D58","v":15}]
[{"$f":"IF(C63=0,'CALCULOS_din Millores'!A59,\"\")","v":""},{"$f":"IF(C63=0,\"\",\"- \"&'CALCULOS_din Millores'!A59)","v":"- Mantenimiento de los perimetros de protección/franjas por control riesgo incendio forestal"},{"$f":"'CALCULOS_din Millores'!D59","v":15}]
[{"$f":"IF(C64=0,'CALCULOS_din Millores'!A60,\"\")","v":""},{"$f":"IF(C64=0,\"\",\"- \"&'CALCULOS_din Millores'!A60)","v":"- En el caso de PAE no delimitados por trama urbana, disponer de información y/o estudios sobre posibles afectaciones a la fauna por la circulación de vehículos, emnisiones atmosféricas, ruidos o contaminación luminosa"},{"$f":"'CALCULOS_din Millores'!D60","v":15}]
[{"$f":"IF(C65=0,'CALCULOS_din Millores'!A61,\"\")","v":""},{"$f":"IF(C65=0,\"\",\"- \"&'CALCULOS_din Millores'!A61)","v":"- En caso de ser consideradas necesarias en estudios previos, crear medidas de protección en fauna (aves nidificantes, protección de zonas especiales, control de ruido, control iluminación, etc.)"},{"$f":"'CALCULOS_din Millores'!D61","v":15}]
[{"$f":"IF(C66=0,'CALCULOS_din Millores'!A62,\"\")","v":""},{"$f":"IF(C66=0,\"\",\"- \"&'CALCULOS_din Millores'!A62)","v":"- Realizar acciones para fomentar la integración paisajística de las construcciones y la morfología general del PAE en el paisaje"},{"$f":"'CALCULOS_din Millores'!D62","v":15}]
[{"$f":"IF(C67=0,'CALCULOS_din Millores'!A63,\"\")","v":""},{"$f":"IF(C67=0,\"\",\"- \"&'CALCULOS_din Millores'!A63)","v":"- Realizar acciones para fomentar que las personas dentro del entorno del PAE tengan una buena percepción del paisaje (acciones como ajardinamiento, eliminación de zonas banales, permitir visuales en el paisaje del entorno, miradores, etc)"},{"$f":"'CALCULOS_din Millores'!D63","v":15}]
[{"$f":"IF(C68=0,'CALCULOS_din Millores'!A64,\"\")","v":""},{"$f":"IF(C68=0,\"\",\"- \"&'CALCULOS_din Millores'!A64)","v":"- Nuevos carreras y carreteras y reparaciones con materiales sonoreductores o medidas similares"},{"$f":"'CALCULOS_din Millores'!D64","v":15}]
[{"$f":"IF(C69=0,'CALCULOS_din Millores'!A65,\"\")","v":""},{"$f":"IF(C69=0,\"\",\"- \"&'CALCULOS_din Millores'!A65)","v":"- Realizar acciones de medida del ruido (inmisión) y/o crear o poder acceder a un servicio para su control de acuerdo a la legislación."},{"$f":"'CALCULOS_din Millores'!D65","v":15}]

{"sheet":"ListaCriterios","index":8,"n_rows":217,"n_cols":15,"rows_kept":217,"cut":false,"hidden":true,"merged":[]}
["CODI_NIV1","NIVELL 1: GRUP","CODI_NIV2","NIVELL 2: LÍNIA","CODI_NIV3","NIVELL 3: ÍTEM","VECTOR DE SOSTENIBILITAT","CODI_NIV4_IND","AVANÇAT?","NIVELL 4: PARÀMETRE/INDICADOR","Tipus_resp","Justificació de l'ítem","Responsable?","Valor Màxim","Proposta de millora"]
[1,"Aspectos sociales y comunicación","1.1","Asociacionismo","1.1.1","Asociacionismo y relación con empresarios","COLABORACIÓN","1.1.1.a",null,"¿Existe asociación de empresarios?","SI/NO",null,"Asociación o entidad de gestión",{"$f":"VLOOKUP(H2,CALCULOS!H:S,12,FALSE)","v":5}]
[1,"Aspectos sociales y comunicación","1.1","Asociacionismo","1.1.1","Asociacionismo y relación con empresarios","COLABORACIÓN","1.1.1.b",null,"¿Más del 50% de las empresas están asociadas?","SI/NO",null,"Asociación o entidad de gestión",{"$f":"VLOOKUP(H3,CALCULOS!H:S,12,FALSE)","v":5}]
[1,"Aspectos sociales y comunicación","1.1","Asociacionismo","1.1.1","Asociacionismo y relación con empresarios","COLABORACIÓN","1.1.1.c","X","¿La asociación dispone de estructura profesionalizada?","SI/NO",null,"Asociación o entidad de gestión",{"$f":"VLOOKUP(H4,CALCULOS!H:S,12,FALSE)","v":15},"Crear una estructura profesional por la asociación o entidad de gestión del PAE"]
[1,"Aspectos sociales y comunicación","1.1","Asociacionismo","1.1.1","Asociacionismo y relación con empresarios","COLABORACIÓN","1.1.1.d",null,"¿Está inscrita la asociación como APEU?","SI/NO","Llei APEU","Asociación o entidad de gestión",{"$f":"VLOOKUP(H5,CALCULOS!H:S,12,FALSE)","v":5}]
[1,"Aspectos sociales y comunicación","1.1","Asociacionismo","1.1.1","Asociacionismo y relación con empresarios","COLABORACIÓN","1.1.1.e",null,"Actividades divulgativas realizadas por la entidad de gestión en su territorio en los últimos 2 años","Grad 0-5","Surt de la Q","Asociación o entidad de gestión",{"$f":"VLOOKUP(H6,CALCULOS!H:S,12,FALSE)","v":5}]
[1,"Aspectos sociales y comunicación","1.1","Asociacionismo","1.1.1","Asociacionismo y relación con empresarios","COLABORACIÓN","1.1.1.f",null,"Evidencias de proyectos realizados con partes interesadas de su territorio en los últimos 2 años","Grad 0-5","Surt de la Q","Asociación o entidad de gestión",{"$f":"VLOOKUP(H7,CALCULOS!H:S,12,FALSE)","v":5}]
[1,"Aspectos sociales y comunicación","1.1","Asociacionismo","1.1.1","Asociacionismo y relación con empresarios","COLABORACIÓN","1.1.1.g",null,"¿Se han realizado acciones, reuniones o actividades con partes interesadas de su territorio?","SI/NO","Surt de la Q","Asociación o entidad de gestión",{"$f":"VLOOKUP(H8,CALCULOS!H:S,12,FALSE)","v":5}]
[1,"Aspectos sociales y comunicación","1.2","Colaboración","1.2.1","Convenios y relación con otras entidades","COLABORACIÓN","1.2.1.a",null,"Reuniones o contactos informativos realizados con partes interesadas de su territorio en los últimos 2 años","Grad 0-5","Surt de la Q","Asociación o entidad de gestión",{"$f":"VLOOKUP(H9,CALCULOS!H:S,12,FALSE)","v":5}]
[1,"Aspectos sociales y comunicación","1.2","Colaboración","1.2.1","Convenios y relación con otras entidades","COLABORACIÓN","1.2.1.b","X","¿Se han realizado acciones, reuniones o actividades con administraciones públicas de su territorio?","SI/NO","Surt de la Q","Asociación o entidad de gestión",{"$f":"VLOOKUP(H10,CALCULOS!H:S,12,FALSE)","v":15},"Iniciar contactos, actividades y reuniones con las administraciones públicas del territorio"]
[1,"Aspectos sociales y comunicación","1.2","Colaboración","1.2.1","Convenios y relación con otras entidades","COLABORACIÓN","1.2.1.c",null,"¿Se han realizado acciones, reuniones o actividades con empresas del área/titulares de parcelas?","SI/NO","Surt de la Q","Asociación o entidad de gestión",{"$f":"VLOOKUP(H11,CALCULOS!H:S,12,FALSE)","v":5}]
[1,"Aspectos sociales y comunicación","1.2","Colaboración","1.2.1","Convenios y relación con otras entidades","COLABORACIÓN","1.2.1.d",null,"¿Se han realizado acciones, reuniones o actividades con entidades de formación de su territorio?","SI/NO","Surt de la Q","Asociación o entidad de gestión",{"$f":"VLOOKUP(H12,CALCULOS!H:S,12,FALSE)","v":5}]
[1,"Aspectos sociales y comunicación","1.2","Colaboración","1.2.1","Convenios y relación con otras entidades","COLABORACIÓN","1.2.1.e",null,"¿Se han realizado acciones, reuniones o actividades con entidades sociales (asociaciones, sindicatos, vecinales, etc?).","SI/NO","Surt de la Q","Asociación o entidad de gestión",{"$f":"VLOOKUP(H13,CALCULOS!H:S,12,FALSE)","v":5}]
[1,"Aspectos sociales y comunicación","1.2","Colaboración","1.2.1","Convenios y relación con otras entidades","COLABORACIÓN","1.2.1.f","X","Se tiene conocimiento sobre necesidades o demandas de las partes interesadas con su correspondiente tratamiento y análisis","SI/NO","Surt de la Q","Asociación o entidad de gestión",{"$f":"VLOOKUP(H14,CALCULOS!H:S,12,FALSE)","v":15},"Crear un procedimiento para recoger y analizar datos de necesidades o demandas de las empresas y entidades del PAE"]
[1,"Aspectos sociales y comunicación","1.2","Colaboración","1.2.1","Convenios y relación con otras entidades","COLABORACIÓN","1.2.1.g",null,"¿Se han realizado actividades de sensibilización, información o mejora de la conservación de las parcelas de polígono en los últimos 2 años?","SI/NO","Surt de la Q","Asociación o entidad de gestión",{"$f":"VLOOKUP(H15,CALCULOS!H:S,12,FALSE)","v":5}]
[1,"Aspectos sociales y comunicación","1.2","Colaboración","1.2.2","Convenios con otras entidades","COLABORACIÓN","1.2.2.a",null,"¿Se dispone de acuerdos o convenios de colaboración/adhesión con otras entidades de gestión de áreas empresariales para el desarrollo de acciones de interés para el polígono o para el desarrollo de sinergias?","SI/NO","Surt de la Q","Asociación o entidad de gestión",{"$f":"VLOOKUP(H16,CALCULOS!H:S,12,FALSE)","v":5}]
[1,"Aspectos sociales y comunicación","1.2","Colaboración","1.2.2","Convenios con otras entidades","COLABORACIÓN","1.2.2.b",null,"Ha participado la entidad de gestión en eventos, jornadas o grupos de trabajo en materia de dinamización de áreas empresariales","SI/NO","Surt de la Q","Asociación o entidad de gestión",{"$f":"VLOOKUP(H17,CALCULOS!H:S,12,FALSE)","v":5}]
[1,"Aspectos sociales y comunicación","1.3","Empleo y formación","1.3.1","Apoyo al empleo y emprendimiento","SOCIAL","1.3.1.a","X","¿Se ha interaccionado con entidades educativas para acercar el polígono a esta actividad?","SI/NO","Surt de la Q","Asociación o entidad de gestión",{"$f":"VLOOKUP(H18,CALCULOS!H:S,12,FALSE)","v":15},"Realizar contactos con entidades educativas para crear propuestas y actividades que permitan mejorar las competencias de los trabajadores y acercar la actividad a los estudiantes"]
[1,"Aspectos sociales y comunicación","1.3","Empleo y formación","1.3.1","Apoyo al empleo y emprendimiento","SOCIAL","1.3.1.b",null,"¿Ha habido algún tipo de interrelación, sensibilización o dinamización del ámbito de la educación reglada en el polígono empresarial?","SI/NO","Surt de la Q","Asociación o entidad de gestión",{"$f":"VLOOKUP(H19,CALCULOS!H:S,12,FALSE)","v":5}]
[1,"Aspectos sociales y comunicación","1.3","Empleo y formación","1.3.1","Apoyo al empleo y emprendimiento","SOCIAL","1.3.1.c",null,"¿Se dispone de bolsa de empleo o similar de acceso público online?","SI/NO","Surt de la Q","Asociación o entidad de gestión",{"$f":"VLOOKUP(H20,CALCULOS!H:S,12,FALSE)","v":5}]
[1,"Aspectos sociales y comunicación","1.3","Empleo y formación","1.3.1","Apoyo al empleo y emprendimiento","SOCIAL","1.3.1.d","X","Actividades de divulgación y promoción del empleo y el emprendimiento entre las empresas del polígono en los últimos 2 años","Grad 1-5","Surt de la Q","Asociación o entidad de gestión",{"$f":"VLOOKUP(H21,CALCULOS!H:S,12,FALSE)","v":15},"Realizar más actividades para promover el empleo y el emprendimiento en las empresas del PAE"]
[1,"Aspectos sociales y comunicación","1.3","Empleo y formación","1.3.1","Apoyo al empleo y emprendimiento","SOCIAL","1.3.1.e","X","Disponibilidad o acceso a plataforma de teleformación","SI/NO","Surt de la Q","Asociación o entidad de gestión",{"$f":"VLOOKUP(H22,CALCULOS!H:S,12,FALSE)","v":15},"Crear o contratar una plataforma de teleformación similar para ofrecer cursos, seminarios, etc. A trabajadores y empresarios"]
[1,"Aspectos sociales y comunicación","1.3","Empleo y formación","1.3.1","Apoyo al empleo y emprendimiento","SOCIAL","1.3.1.g","X","¿Se han realizado acciones en el ámbito de la formación para el empleo en el polígono empresarial, de acuerdo con las necesidades de las empresas?","SI/NO","Surt de la Q","Asociación o entidad de gestión",{"$f":"VLOOKUP(H23,CALCULOS!H:S,12,FALSE)","v":15},"Realizar acciones en el ámbito de la formación para el empleo en el polígono empresarial de acuerdo con las necesidades de las empresas"]
[1,"Aspectos sociales y comunicación","1.3","Empleo y formación","1.3.1","Apoyo al empleo y emprendimiento","SOCIAL","1.3.1.h","X","¿Dispone la entidad de un programa de bolsa de empleo o similar para personas que buscan trabajo en el territorio?","SI/NO","Surt de la Q","Asociación o entidad de gestión",{"$f":"VLOOKUP(H24,CALCULOS!H:S,12,FALSE)","v":15},"Dispone de un programa de bolsa de empleo o similar para personas que buscan trabajo en el territorio"]
[1,"Aspectos sociales y comunicación","1.3","Empleo y formación","1.3.1","Apoyo al empleo y emprendimiento","SOCIAL","1.3.1.i",null,"¿Existe formación en el territorio cercano adecuado a las necesidades de las empresas del PAE?","SI/NO","Surt de la Q","Asociación o entidad de gestión",{"$f":"VLOOKUP(H25,CALCULOS!H:S,12,FALSE)","v":5}]
[1,"Aspectos sociales y comunicación","1.4","Promoción","1.4.1","Comunicación, promoción y señalización","SOCIAL","1.4.1.a",null,"¿El área empresarial tiene una imagen corporativa (logo) del área empresarial?","SI/NO","Surt de la Q","Asociación o entidad de gestión",{"$f":"VLOOKUP(H26,CALCULOS!H:S,12,FALSE)","v":5}]
[1,"Aspectos sociales y comunicación","1.4","Promoción","1.4.1","Comunicación, promoción y señalización","SOCIAL","1.4.1.b",null,"Se realizan acciones periódicas de revisión y mejora de la estrategia de comunicación","SI/NO","Surt de la Q","Asociación o entidad de gestión",{"$f":"VLOOKUP(H27,CALCULOS!H:S,12,FALSE)","v":5}]
[1,"Aspectos sociales y comunicación","1.4","Promoción","1.4.1","Comunicación, promoción y señalización","SOCIAL","1.4.1.c","X","¿Se utiliza de forma clara y definida la imagen corporativa?","SI/NO","Surt de la Q","Asociación o entidad de gestión",{"$f":"VLOOKUP(H28,CALCULOS!H:S,12,FALSE)","v":15},"Promover y/o participar en jornadas, eventos o proyectos que fomenten la responsabilidad social (respecto medio ambiente, igualdad género, inserción laboral etc.)"]
[1,"Aspectos sociales y comunicación","1.4","Promoción","1.4.1","Comunicación, promoción y señalización","SOCIAL","1.4.1.d","X","¿La entidad cuenta con una estrategia o política de comunicación con objetivos claros, definidos y conocidos por sus integrantes?","SI/NO","Surt de la Q","Asociación o entidad de gestión",{"$f":"VLOOKUP(H29,CALCULOS!H:S,12,FALSE)","v":15},"Aprobar una estrategia/política de comunicación"]
[1,"Aspectos sociales y comunicación","1.4","Promoción","1.4.1","Comunicación, promoción y señalización","SOCIAL","1.4.1.e","X","¿Se tiene una recopilación de impactos y presencia de polígono o de la entidad de gestión en los medios de comunicación?","SI/NO","Surt de la Q","Asociación o entidad de gestión",{"$f":"VLOOKUP(H30,CALCULOS!H:S,12,FALSE)","v":15},"Registrar las apariciones de la asociación o equivalente y de sus empresas en los medios de comunicación"]
[1,"Aspectos sociales y comunicación","1.4","Promoción","1.4.1","Comunicación, promoción y señalización","SOCIAL","1.4.1.f",null,"Grado de presencia en redes sociales","Grad 1-5","Surt de la Q","Asociación o entidad de gestión",{"$f":"VLOOKUP(H31,CALCULOS!H:S,12,FALSE)","v":5}]
[1,"Aspectos sociales y comunicación","1.4","Promoción","1.4.1","Comunicación, promoción y señalización","SOCIAL","1.4.1.g","X","¿Se han promovido / participado en jornadas, eventos o proyectos que fomenten la responsabilidad social (respecto medio ambiente, igualdad género, inserción laboral etc.)?","SI/NO","Surt de la Q","Asociación o entidad de gestión",{"$f":"VLOOKUP(H32,CALCULOS!H:S,12,FALSE)","v":15},"Promover y/o participar en jornadas o proyectos con objetivos sociales y/o ambientales"]
[2,"Gestión de los recursos","2.1","agua","2.1.1","Eficiencia en el consumo de agua","AGUA","2.1.1.a","X","¿Se dispone de herramientas por control y datos de consumo de agua (gestor hídrico)?","SI/NO",null,"Asociación o entidad de gestión",{"$f":"VLOOKUP(H33,CALCULOS!H:S,12,FALSE)","v":15},"Obtener datos de consumo de agua de las empresas con el máximo nivel de detalle y actualización, avanzando hacia la figura del gestor hídrico"]
[2,"Gestión de los recursos","2.1","agua","2.1.2","Conocimiento sobre aguas residuales","AGUA","2.1.2.a",null,"¿Se dispone de Información disponible sobre calidad y tipos de agua residual?","SI/NO",null,"Asociación o entidad de gestión",{"$f":"VLOOKUP(H34,CALCULOS!H:S,12,FALSE)","v":10}]
[2,"Gestión de los recursos","2.2","Energía y cambio climático","2.2.1","Gestión energética","ENERGÍA Y CAMBIO CLIMATIC","2.2.1.a","X","¿Se dispone de información sobre el consumo eléctrico?","Grad 1-5",null,"Asociación o entidad de gestión",{"$f":"VLOOKUP(H35,CALCULOS!H:S,12,FALSE)","v":15},"Obtener datos de consumo eléctrico a las empresas con el máximo nivel de detalle y actualización, avanzando hacia la figura del gestor energético."]
[2,"Gestión de los recursos","2.2","Energía y cambio climático","2.2.1","Gestión energética","ENERGÍA Y CAMBIO CLIMATIC","2.2.1.b","X","¿Se dispone de información sobre el consumo térmico?","Grad 1-5",null,"Asociación o entidad de gestión",{"$f":"VLOOKUP(H36,CALCULOS!H:S,12,FALSE)","v":15},"Obtener datos de consumo térmico las empresas con el máximo nivel de detalle y actualización, avanzando hacia la figura del gestor energético."]
[2,"Gestión de los recursos","2.2","Energía y cambio climático","2.2.2","Producción de energía renovable","ENERGÍA Y CAMBIO CLIMATIC","2.2.2.a","x","¿Se dispone de información sobre la producción de energía renovable en las empresas?","SI/NO",null,"Asociación o entidad de gestión",{"$f":"VLOOKUP(H37,CALCULOS!H:S,12,FALSE)","v":15},"Disponer de los datos de producción de energías renovables en el PAE"]
[2,"Gestión de los recursos","2.2","Energía y cambio climático","2.2.2","Producción de energía renovable","ENERGÍA Y CAMBIO CLIMATIC","2.2.2.b","X","¿Se dispone de espacio para la creación de infraestructuras para producción de e.renovable?","SI/NO",null,"Asociación o entidad de gestión",{"$f":"VLOOKUP(H38,CALCULOS!H:S,12,FALSE)","v":15},"Disponer o realizar reservas de espacio para poder crear infraestructuras energéticas"]
[2,"Gestión de los recursos","2.2","Energía y cambio climático","2.2.2","Producción de energía renovable","ENERGÍA Y CAMBIO CLIMATIC","2.2.2.c","x","¿Existen infraestructuras de producción (planta biomasa, parque solar…)?","SI/NO",null,"Asociación o entidad de gestión",{"$f":"VLOOKUP(H39,CALCULOS!H:S,12,FALSE)","v":15},"Disponer de infraestructuras de producción de energía renovable."]
[2,"Gestión de los recursos","2.2","Energía y cambio climático","2.2.3","Autoproducción y generación compartida","ENERGÍA Y CAMBIO CLIMATIC","2.2.3.a","x","¿Existe alguna comunidad energética?","Grad 1-5",null,"Asociación o entidad de gestión",{"$f":"VLOOKUP(H40,CALCULOS!H:S,12,FALSE)","v":15},"Fomentar y/o participar en una comunidad energética local que incorpore a empresas del PAE"]
[2,"Gestión de los recursos","2.2","Energía y cambio climático","2.2.4","Potencial de producción e.solar/eolica","ENERGÍA Y CAMBIO CLIMATIC","2.2.4.a","x","¿Se dispone de información sobre el potencial de producción solar?","SI/NO",null,"Medio Ambiente",{"$f":"VLOOKUP(H41,CALCULOS!H:S,12,FALSE)","v":15},"Elaborar un estudio del potencial de producción de energía solar fotovoltaica/térmica en el PAE"]
[2,"Gestión de los recursos","2.2","Energía y cambio climático","2.2.4","Potencial de producción e.solar/eolica","ENERGÍA Y CAMBIO CLIMATIC","2.2.4.b","x","¿Se dispone de información sobre el potencial de producción eólico? ¿Existen registros o estacion de medida viento?","SI/NO",null,"Medio Ambiente",{"$f":"VLOOKUP(H42,CALCULOS!H:S,12,FALSE)","v":15},"Disponer de información sobre el potencial de producción eólica y/o registros o estacion de medida viento."]
[2,"Gestión de los recursos","2.2","Energía y cambio climático","2.2.5","Análisis de eficiencia energética para las empresas","ENERGÍA Y CAMBIO CLIMATIC","2.2.5.a","x","¿Se han analizado medidas de eficiencia por las empresas, tales como termografías (aéreas oa pie) o asesoramientos personalidades?","SI/NO",null,"Medio Ambiente",{"$f":"VLOOKUP(H43,CALCULOS!H:S,12,FALSE)","v":15},"Realizar estudios o iniciar un servicio para el fomento de la eficiencia energética en las empresas."]
[2,"Gestión de los recursos","2.2","Energía y cambio climático","2.2.6","Gases Efecto Invernadero","ENERGÍA Y CAMBIO CLIMATIC","2.2.6.a","x","Se tiene conocimiento de otras fuentes difusas de GEI (CFC's, COVs…)","SI/NO",null,"Medio Ambiente",{"$f":"VLOOKUP(H44,CALCULOS!H:S,12,FALSE)","v":15},"Obtener datos de otras fuentes difusas de GEI (CFC's, COVs…)"]
[2,"Gestión de los recursos","2.2","Energía y cambio climático","2.2.6","Gases Efecto Invernadero","ENERGÍA Y CAMBIO CLIMATIC","2.2.6.b","x","¿Se ofrece asistencia a las empresas para acogerse a algún sistema de comensación de emisiones?","SI/NO",null,"Medio Ambiente",{"$f":"VLOOKUP(H45,CALCULOS!H:S,12,FALSE)","v":15},"Ofrecer a las empresas un sistema de compensación de emisiones, preferiblemente con proyectos locales"]
[2,"Gestión de los recursos","2.2","Energía y cambio climático","2.2.6","Gases Efecto Invernadero","ENERGÍA Y CAMBIO CLIMATIC","2.2.6.c","x","¿La gestión del polígono compensa sus emisiones?","SI/NO",null,"Asociación o entidad de gestión",{"$f":"VLOOKUP(H46,CALCULOS!H:S,12,FALSE)","v":15},"Compensar sus emisiones relativas a las actividades de gestión del PAE"]
[2,"Gestión de los recursos","2.3","Materia prima y producción","2.3.1","Matería local","MATERIALES","2.3.1.a","x","Se dispone de información o estudios sobre los recursos materiales de entrada y salida (materias primas, producción…)","SI/NO",null,"Medio Ambiente",{"$f":"VLOOKUP(H47,CALCULOS!H:S,12,FALSE)","v":15},"Obtener información y/o estudiar los flujos de materiales en el PAE, con datos de consumo de materias primas y producción material"]
[2,"Gestión de los recursos","2.3","Materia prima y producción","2.3.2","Tipología de actividad para optimizar recursos","MATERIALES","2.3.2.a",null,"¿Cuál es el grado de conocimiento de las actividades presentes?","Grad 1-5",null,"Asociación o entidad de gestión",{"$f":"VLOOKUP(H48,CALCULOS!H:S,12,FALSE)","v":10}]
[2,"Gestión de los recursos","2.3","Materia prima y producción","2.3.2","Tipología de actividad para optimizar recursos","MATERIALES","2.3.2.b","x","¿Se ha realizado un análisis del ecosistema/metabolismo industrial?","SI/NO",null,"Promoción económica",{"$f":"VLOOKUP(H49,CALCULOS!H:S,12,FALSE)","v":15},"Realizar un análisis del ecosistema/metabolismo industrial"]
[2,"Gestión de los recursos","2.4","Residuos","2.4.1","Generación de residuos","RESIDUOS","2.4.1.a","x","¿Se dispone de datos de generación de residuos global del PAE?","SI/NO",null,"Medio Ambiente",{"$f":"VLOOKUP(H50,CALCULOS!H:S,12,FALSE)","v":15},"Solicitar al ARC (Generalitat de Catalunya) y obtener los datos de generación de residuos de las empresas del PAE"]
[2,"Gestión de los recursos","2.4","Residuos","2.4.1","Generación de residuos","RESIDUOS","2.4.1.b","x","¿Existe algún tipo de política, estrategia o se han realizado actividades dentro del concepto Zero-Waste?","Grad 1-5",null,"Medio Ambiente",{"$f":"VLOOKUP(H51,CALCULOS!H:S,12,FALSE)","v":15},"Aprobar una política, definir estrategias y realizar actividades para la reducción de residuos, tanto en la gestión como en las empresas del PAE"]
[2,"Gestión de los recursos","2.4","Residuos","2.4.2","Valorización de residuos","RESIDUOS","2.4.2.a","x","¿Existen políticas de gestión y/o valorización compartida de residuos?","SI/NO",null,"Medio Ambiente",{"$f":"VLOOKUP(H52,CALCULOS!H:S,12,FALSE)","v":15},"Identificar y fomentar iniciativas para el reciclaje y recuperación de residuos de forma compartida"]
[2,"Gestión de los recursos","2.4","Residuos","2.4.2","Valorización de residuos","RESIDUOS","2.4.2.b",null,"¿Existen valorizadores de residuos en el propio PAE?","SI/NO",null,"Medio Ambiente",{"$f":"VLOOKUP(H53,CALCULOS!H:S,12,FALSE)","v":10}]
[2,"Gestión de los recursos","2.4","Residuos","2.4.2","Valorización de residuos","RESIDUOS","2.4.2.c","x","¿Se dispone de espacios reservados o disponibles por infraestructuras de la gestión de residuos individual o compartida?","SI/NO",null,"Medio Ambiente",{"$f":"VLOOKUP(H54,CALCULOS!H:S,12,FALSE)","v":15},"Disponer o realizar reservas de espacio para poder crear infraestructuras para la valorización de residuos"]
[2,"Gestión de los recursos","2.4","Residuos","2.4.3","Generación de residuos","RESIDUOS","2.4.3.a",null,"¿Se han elaborado materiales para la difusión y concienciación en materia de gestión de residuos (reducción, reutilización y reciclaje)?","SI/NO",null,"Medio Ambiente",{"$f":"VLOOKUP(H55,CALCULOS!H:S,12,FALSE)","v":10}]
[2,"Gestión de los recursos","2.4","Residuos","2.4.4","Recogida de residuos","RESIDUOS","2.4.4.a",null,"(En caso de corresponder la gestión en el área empresarial): ¿Se encuentran disponibles los documentos legales asociados a la gestión de residuos (transportista/gestor)?","SI/NO",null,"Medio Ambiente",{"$f":"VLOOKUP(H56,CALCULOS!H:S,12,FALSE)","v":10}]
[2,"Gestión de los recursos","2.4","Residuos","2.4.4","Recogida de residuos","RESIDUOS","2.4.4.b",null,"(En caso de corresponder la gestión en el área) : ¿Se dispone de los contratos con la empresa proveedora del servicio de gestión de residuos?","SI/NO",null,"Medio Ambiente",{"$f":"VLOOKUP(H57,CALCULOS!H:S,12,FALSE)","v":10}]
[2,"Gestión de los recursos","2.4","Residuos","2.4.4","Recogida de residuos","RESIDUOS","2.4.4.c",null,"Existen papeleras en número y estado de conservación adecuado a las necesidades del PAE","Grad 1-5",null,"Vía pública",{"$f":"VLOOKUP(H58,CALCULOS!H:S,12,FALSE)","v":10}]
[2,"Gestión de los recursos","2.4","Residuos","2.4.4","Recogida de residuos","RESIDUOS","2.4.4.d",null,"¿Existen contenedores de recogida municipal en la vía pública? (negativo)","SI/NO",null,"Vía pública",{"$f":"VLOOKUP(H59,CALCULOS!H:S,12,FALSE)","v":10}]
[2,"Gestión de los recursos","2.5","Simbiosis industrial","2.5.1","Especialización productiva en los PAE","MATERIALES","2.5.1.a","x","¿Existen políticas para la implantación/promoción según tipos de actividades/especialización?","SI/NO",null,"Promoción económica",{"$f":"VLOOKUP(H60,CALCULOS!H:S,12,FALSE)","v":15},"Definir políticas de selección de las empresas que se implanten según su actividad, para fomentar la simbiosis industrial"]
[2,"Gestión de los recursos","2.5","Simbiosis industrial","2.5.2","Potencialidad de simbiosis industrial","MATERIALES","2.5.2.a","x","¿Existe algún servicio de simbiosis industrial o equivalente?","Grad 1-5",null,"Promoción económica",{"$f":"VLOOKUP(H61,CALCULOS!H:S,12,FALSE)","v":15},"Participar o generar iniciativas de fomento de la simbiosis industrial, y trabajar para crear una verdadera oficina/servicio de simbiosis"]
[2,"Gestión de los recursos","2.5","Simbiosis industrial","2.5.2","Potencialidad de simbiosis industrial","MATERIALES","2.5.2.b","x","¿Se ha realizado algún estudio del potencial de simbiosis industrial en el PAE o en su territorio?","SI/NO",null,"Promoción económica",{"$f":"VLOOKUP(H62,CALCULOS!H:S,12,FALSE)","v":15},"Estudiar el potencial de sombiosis industrial en el ámbito del PAE"]
[2,"Gestión de los recursos","2.5","Simbiosis industrial","2.5.3","Reaprovechamiento de recurso-residuo","RESIDUOS","2.5.3.a","x","¿Se realizan acciones técnicas o divulgativas que fomenten la recuperación de recursos y residuos en el PAE?","SI/NO",null,"Medio Ambiente",{"$f":"VLOOKUP(H63,CALCULOS!H:S,12,FALSE)","v":15},"Realizar acciones para fomentar la recuperación de recursos y residuos en el PAE"]
[2,"Gestión de los recursos","2.5","Simbiosis industrial","2.5.3","Reaprovechamiento de recurso-residuo","RESIDUOS","2.5.3.b","x","¿Se conoce la cantidad de residuos que se recuperan en el propio PAE?","SI/NO",null,"Medio Ambiente",{"$f":"VLOOKUP(H64,CALCULOS!H:S,12,FALSE)","v":15},"Disponer de los datos de residuos que realmente se recuperen."]
[3,"Infrastructuras y servicios","3.1","Infrastructuras avanzadas","3.1.1","Red separativa de aguas (pluviales, grises)","AGUA","3.1.1.a","x","¿Existe red de separativa de aguas pluviales?","Grad 1-5",null,"Vía pública",{"$f":"VLOOKUP(H65,CALCULOS!H:S,12,FALSE)","v":15},"Proyectar y ejecutar una red de aguas pluviales, separada de las aguas grises y residuales"]
[3,"Infrastructuras y servicios","3.1","Infrastructuras avanzadas","3.1.1","Red separativa de aguas (pluviales, grises)","AGUA","3.1.1.b","x","¿Existe red de separativa de aguas grises?","Grad 1-5",null,"Vía pública",{"$f":"VLOOKUP(H66,CALCULOS!H:S,12,FALSE)","v":15},"Proyectar y ejecutar una red de aguas grises, separada de las aguas grises y residuales"]
[3,"Infrastructuras y servicios","3.1","Infrastructuras avanzadas","3.1.1","Red separativa de aguas (pluviales, grises)","AGUA","3.1.1.c","x","¿Se dispone de algún sistema de recogida para el aprovechamiento de aguas pluviales?","SI/NO",null,"Vía pública",{"$f":"VLOOKUP(H67,CALCULOS!H:S,12,FALSE)","v":15},"Proyectar y ejecutar un sistema de recogida y aprovechamiento de aguas pluviales"]
[3,"Infrastructuras y servicios","3.1","Infrastructuras avanzadas","3.1.2","Infraestructuras avanzadas para la economía circular","COLABORACIÓN","3.1.2.a","x","¿Se ha realizado algún estudio de necesidades/oportunidades de infraestructuras avanzadas (p.ej. biorefinería, planta biogas)?","SI/NO",null,"Vía pública",{"$f":"VLOOKUP(H68,CALCULOS!H:S,12,FALSE)","v":15},"Realizar un estudio del potencial de implantación de infraestructuras avanzadas como biorefineras, plantas de biogás, etc."]
[3,"Infrastructuras y servicios","3.1","Infrastructuras avanzadas","3.1.2","Infraestructuras avanzadas para la economía circular","COLABORACIÓN","3.1.2.b","x","¿Existe alguna infraestructura del tipo: biorefinería, planta biogas, banco de ensayos de materiales, EDAR específica por tipos de aguas, …?","Grad 0-5",null,"Vía pública",{"$f":"VLOOKUP(H69,CALCULOS!H:S,12,FALSE)","v":15},"Captar empresas y/o fomentar la cración de infraestructuras ambientales avanzadas como biorefinería, planta biogas, banco de ensayos de materiales, EDAR específica por tipos de aguas, etc."]
[3,"Infrastructuras y servicios","3.1","Infrastructuras avanzadas","3.1.3","Energía compartida (calor, electricidad)","ENERGÍA Y CAMBIO CLIMATIC","3.1.3.a","x","¿Existe alguna central de producción de energía renovable gestionada por el PAE?","SI/NO",null,"Vía pública",{"$f":"VLOOKUP(H70,CALCULOS!H:S,12,FALSE)","v":15},"Crear una central de producción de energía renovable, de gestión pública o participada por la asociación"]
[3,"Infrastructuras y servicios","3.1","Infrastructuras avanzadas","3.1.3","Energía compartida (calor, electricidad)","ENERGÍA Y CAMBIO CLIMATIC","3.1.3.b","x","Existe alguna infraestructura relacionada con la acumulación de energía (baterías), y/o smart grids","SI/NO",null,"Vía pública",{"$f":"VLOOKUP(H71,CALCULOS!H:S,12,FALSE)","v":15},"Fomentar y/o participar en infraestructuras de gestión energética como baterías industriales, smart grids, etc."]
[3,"Infrastructuras y servicios","3.1","Infrastructuras avanzadas","3.1.4","Redes de calor y frío","ENERGÍA Y CAMBIO CLIMATIC","3.1.4.a","x","¿Existe red de distribución de calor?","SI/NO",null,"Vía pública",{"$f":"VLOOKUP(H72,CALCULOS!H:S,12,FALSE)","v":15},"Fomentar y/o participar en la creación de redes de producción de calor"]
[3,"Infrastructuras y servicios","3.1","Infrastructuras avanzadas","3.1.4","Redes de calor y frío","ENERGÍA Y CAMBIO CLIMATIC","3.1.4.b","x","¿Existe red de distribución de frío?","SI/NO",null,"Vía pública",{"$f":"VLOOKUP(H73,CALCULOS!H:S,12,FALSE)","v":15},"Fomentar y/o participar en la creación de redes de producción de frío"]
[3,"Infrastructuras y servicios","3.1","Infrastructuras avanzadas","3.1.4","Redes de calor y frío","ENERGÍA Y CAMBIO CLIMATIC","3.1.4.c","x","Si no hay redes, ¿hay previsión de espacio en zanjas para extenderla?","SI/NO",null,"Vía pública",{"$f":"VLOOKUP(H74,CALCULOS!H:S,12,FALSE)","v":15},"Disponer o realizar reservas de espacio de zanjas por redes, si no se dispone de ellas"]
[3,"Infrastructuras y servicios","3.1","Infrastructuras avanzadas","3.1.4","Redes de calor y frío","ENERGÍA Y CAMBIO CLIMATIC","3.1.4.d","x","¿Se ha estudiado la viabilidad de una red de calor/frío?","SI/NO",null,"Vía pública",{"$f":"VLOOKUP(H75,CALCULOS!H:S,12,FALSE)","v":15},"Realizar un estudio del potencial de redes de calor/frío en el ámbito del PAE"]
[3,"Infrastructuras y servicios","3.1","Infrastructuras avanzadas","3.1.5","Recarga VE","MOVILIDAD","3.1.5.a","x","Concentración (num/1000 trabajadores) de puntos de recarga por vehículos eléctricos accesibles a trabajadores y visitantes","Grad 1-5",null,"Vía pública",{"$f":"VLOOKUP(H76,CALCULOS!H:S,12,FALSE)","v":15},"Instalar y/o fomentar la instalación de puntos de recarga por vehículos eléctricos"]
[3,"Infrastructuras y servicios","3.1","Infrastructuras avanzadas","3.1.5","Recarga VE","MOVILIDAD","3.1.5.a","x","¿Existe alguna fotolinera en el PAE?","SI/NO",null,"Medio Ambiente",{"$f":"VLOOKUP(H77,CALCULOS!H:S,12,FALSE)","v":15},"Instalar y/o fomentar la instalación de una fotolinera (zona de recarga rápida de vehículos eléctricos)"]
[3,"Infrastructuras y servicios","3.2","Infrastructuras básicas","3.2.1","Abastecimiento de agua","AGUA","3.2.01.a","x","¿Se ha realizado un estudio de detección de fugas en el sistema de distribución de agua?","SI/NO",null,"Vía pública",{"$f":"VLOOKUP(H78,CALCULOS!H:S,12,FALSE)","v":15},"Estudiar el rendimiento del sistema de distribución de agua potable analizando posibles fugas"]
[3,"Infrastructuras y servicios","3.2","Infrastructuras básicas","3.2.1","Abastecimiento de agua","AGUA","3.2.01.b",null,"¿Se dispone de información sobre la relación Agua facturada/Agua consumida?","SI/NO",null,"Vía pública",{"$f":"VLOOKUP(H79,CALCULOS!H:S,12,FALSE)","v":10}]
[3,"Infrastructuras y servicios","3.2","Infrastructuras básicas","3.2.1","Abastecimiento de agua","AGUA","3.2.01.c",null,"En caso de disponer de información, ¿cuál es la eficiencia de la red de distribución (%)?","Grad 1-5",null,"Vía pública",{"$f":"VLOOKUP(H80,CALCULOS!H:S,12,FALSE)","v":10}]
[3,"Infrastructuras y servicios","3.2","Infrastructuras básicas","3.2.1","Abastecimiento de agua","AGUA","3.2.01.d",null,"¿Cuál es la disponibilidad de agua de pozos y/o aguas pluviales (cualitativo)?","Grad 1-5",null,"Vía pública",{"$f":"VLOOKUP(H81,CALCULOS!H:S,12,FALSE)","v":10}]
[3,"Infrastructuras y servicios","3.2","Infrastructuras básicas","3.2.1","Abastecimiento de agua","AGUA","3.2.01.h",null,"(En caso de existir depósitos para abastecimiento) El acceso a los depósitos se restringe a las personas autorizadas","SI/NO","Surt de la Q","Vía pública",{"$f":"VLOOKUP(H82,CALCULOS!H:S,12,FALSE)","v":10}]
[3,"Infrastructuras y servicios","3.2","Infrastructuras básicas","3.2.1","Abastecimiento de agua","AGUA","3.2.01.i",null,"(En caso de existir depósitos para abastecimiento) Los depósitos se encuentran bien conservados y limpios","SI/NO","Surt de la Q","Vía pública",{"$f":"VLOOKUP(H83,CALCULOS!H:S,12,FALSE)","v":10}]
[3,"Infrastructuras y servicios","3.2","Infrastructuras básicas","3.2.1","Abastecimiento de agua","AGUA","3.2.01.j",null,"¿Se dispone de planos de la red de abastecimiento de agua?","SI/NO","Surt de la Q","Vía pública",{"$f":"VLOOKUP(H84,CALCULOS!H:S,12,FALSE)","v":10}]
[3,"Infrastructuras y servicios","3.2","Infrastructuras básicas","3.2.1","Abastecimiento de agua","AGUA","3.2.01.k",null,"Se dispone del contrato de prestación de servicio de abastecimiento de agua (por ejemplo, adjudicación pública del servicio)","SI/NO","Surt de la Q","Vía pública",{"$f":"VLOOKUP(H85,CALCULOS!H:S,12,FALSE)","v":10}]
[3,"Infrastructuras y servicios","3.2","Infrastructuras básicas","3.2.1","Abastecimiento de agua","AGUA","3.2.01.l",null,"¿Se tienen disponibles analíticas periódicas sobre la potabilidad del agua de consumo?","SI/NO","Surt de la Q","Vía pública",{"$f":"VLOOKUP(H86,CALCULOS!H:S,12,FALSE)","v":10}]
[3,"Infrastructuras y servicios","3.2","Infrastructuras básicas","3.2.1","Abastecimiento de agua","AGUA","3.2.01.m",null,"¿Se dispone de documentos oficiales que reflejan las principales características de la red de abastecimiento de agua (por ejemplo pliego condiciones técnicas de prestación de servicio)?","SI/NO","Surt de la Q","Vía pública",{"$f":"VLOOKUP(H87,CALCULOS!H:S,12,FALSE)","v":10}]
[3,"Infrastructuras y servicios","3.2","Infrastructuras básicas","3.2.1","Abastecimiento de agua","AGUA","3.2.01.n",null,"¿El caudal de la red de abastecimiento es adecuado a las necesidades del área?","SI/NO","Surt de la Q","Vía pública",{"$f":"VLOOKUP(H88,CALCULOS!H:S,12,FALSE)","v":10}]
[3,"Infrastructuras y servicios","3.2","Infrastructuras básicas","3.2.1","Abastecimiento de agua","AGUA","3.2.01.o",null,"En caso de competencia exclusiva del área, ¿los materiales empleados son los adecuados y se cumple la legislación vigente?","Grad 1-5","Surt de la Q","Vía pública",{"$f":"VLOOKUP(H89,CALCULOS!H:S,12,FALSE)","v":10}]
[3,"Infrastructuras y servicios","3.2","Infrastructuras básicas","3.2.1","Abastecimiento de agua","AGUA","3.2.01.p",null,"¿La red de abastecimiento de agua es adecuada al tipo de área empresarial?","SI/NO","Surt de la Q","Vía pública",{"$f":"VLOOKUP(H90,CALCULOS!H:S,12,FALSE)","v":10}]
[3,"Infrastructuras y servicios","3.2","Infrastructuras básicas","3.2.1","Abastecimiento de agua","AGUA","3.2.01.q",null,"¿La red de abastecimiento está completamente en servicio?","SI/NO","Surt de la Q","Vía pública",{"$f":"VLOOKUP(H91,CALCULOS!H:S,12,FALSE)","v":10}]
[3,"Infrastructuras y servicios","3.2","Infrastructuras básicas","3.2.2","Saneamiento de agua","AGUA","3.2.02.a",null,"¿Se dispone de plano de la red de saneamiento?","SI/NO","Surt de la Q","Vía pública",{"$f":"VLOOKUP(H92,CALCULOS!H:S,12,FALSE)","v":10}]
[3,"Infrastructuras y servicios","3.2","Infrastructuras básicas","3.2.2","Saneamiento de agua","AGUA","3.2.02.b",null,"¿La red de saneamiento es adecuada al tipo de área empresarial?","SI/NO","Surt de la Q","Vía pública",{"$f":"VLOOKUP(H93,CALCULOS!H:S,12,FALSE)","v":10}]
[3,"Infrastructuras y servicios","3.2","Infrastructuras básicas","3.2.2","Saneamiento de agua","AGUA","3.2.02.c",null,"¿La red de saneamiento está completamente en servicio?","SI/NO",null,"Vía pública",{"$f":"VLOOKUP(H94,CALCULOS!H:S,12,FALSE)","v":10}]
[3,"Infrastructuras y servicios","3.2","Infrastructuras básicas","3.2.2","Saneamiento de agua","AGUA","3.2.02.d",null,"¿La red de saneamiento del PAE desagua en depuradora, del PAE o externa?","SI/NO","Surt de la Q","Vía pública",{"$f":"VLOOKUP(H95,CALCULOS!H:S,12,FALSE)","v":10}]
[3,"Infrastructuras y servicios","3.2","Infrastructuras básicas","3.2.2","Saneamiento de agua","AGUA","3.2.02.e","x","¿Existe algún tipo de red de agua regenerada?","SI/NO",null,"Vía pública",{"$f":"VLOOKUP(H96,CALCULOS!H:S,12,FALSE)","v":15},"Proyectar y ejecutar una red de tratamiento y regeneración de agua"]
[3,"Infrastructuras y servicios","3.2","Infrastructuras básicas","3.2.2","Saneamiento de agua","AGUA","3.2.02.e",null,"La capacidad de depuración es adecuada a la tipología y volumen de empresas del área","SI/NO",null,"Vía pública",{"$f":"VLOOKUP(H97,CALCULOS!H:S,12,FALSE)","v":15},"Disponer de un sistema de depuración de agua adecuado a la tipología y volumen de empresas del PAE"]
[3,"Infrastructuras y servicios","3.2","Infrastructuras básicas","3.2.2","Saneamiento de agua","AGUA","3.2.02.f",null,"Proporción de empresas que tienen acceso a EDAR","Grad 1-5","Surt de la Q","Vía pública",{"$f":"VLOOKUP(H98,CALCULOS!H:S,12,FALSE)","v":10}]
[3,"Infrastructuras y servicios","3.2","Infrastructuras básicas","3.2.2","Saneamiento de agua","AGUA","3.2.02.g",null,"¿Cuál es el grado de extensión de la red de alcantarillado (grado de acceso de las empresas)?","Grad 1-5","Surt de la Q","Vía pública",{"$f":"VLOOKUP(H99,CALCULOS!H:S,12,FALSE)","v":10}]
[3,"Infrastructuras y servicios","3.2","Infrastructuras básicas","3.2.2","Saneamiento de agua","AGUA","3.2.02.h",null,"¿Se tiene acceso al contrato de prestación de servicio de red de saneamiento (por ejemplo, adjudicación pública del servicio)?","SI/NO","Surt de la Q","Vía pública",{"$f":"VLOOKUP(H100,CALCULOS!H:S,12,FALSE)","v":10}]
[3,"Infrastructuras y servicios","3.2","Infrastructuras básicas","3.2.2","Saneamiento de agua","AGUA","3.2.02.i",null,"¿Se tiene acceso a las analíticas periódicas del vertido?","SI/NO","Surt de la Q","Vía pública",{"$f":"VLOOKUP(H101,CALCULOS!H:S,12,FALSE)","v":10}]
[3,"Infrastructuras y servicios","3.2","Infrastructuras básicas","3.2.2","Saneamiento de agua","AGUA","3.2.02.j",null,"(En caso de ser específica del área) ¿La EDAR funciona correctamente y se mantiene de forma adecuada?","SI/NO","Surt de la Q","Vía pública",{"$f":"VLOOKUP(H102,CALCULOS!H:S,12,FALSE)","v":10}]
[3,"Infrastructuras y servicios","3.2","Infrastructuras básicas","3.2.2","Saneamiento de agua","AGUA","3.2.02.k",null,"¿Se tienen documentos oficiales que reflejan las principales características de la red de saneamiento (por ejemplo, pliego de condiciones técnicas de prestación de servicio)? .","SI/NO","Surt de la Q","Vía pública",{"$f":"VLOOKUP(H103,CALCULOS!H:S,12,FALSE)","v":10}]
[3,"Infrastructuras y servicios","3.2","Infrastructuras básicas","3.2.3","Alumbrado público","ENERGÍA Y CAMBIO CLIMATIC","3.2.03.a",null,"Cantidad de lámparas consideradas eficientes energéticamente (%)","Grad 1-5","Surt de la Q","Vía pública",{"$f":"VLOOKUP(H104,CALCULOS!H:S,12,FALSE)","v":5}]
[3,"Infrastructuras y servicios","3.2","Infrastructuras básicas","3.2.3","Alumbrado público","ENERGÍA Y CAMBIO CLIMATIC","3.2.03.b",null,"Superficie iluminada (%)","Grad 1-5","Surt de la Q","Vía pública",{"$f":"VLOOKUP(H105,CALCULOS!H:S,12,FALSE)","v":5}]
[3,"Infrastructuras y servicios","3.2","Infrastructuras básicas","3.2.3","Alumbrado público","ENERGÍA Y CAMBIO CLIMATIC","3.2.03.c",null,"¿Se tiene el Contrato de prestación de servicio de alumbrado público (por ejemplo, adjudicación pública del servicio)?","SI/NO","Surt de la Q","Vía pública",{"$f":"VLOOKUP(H106,CALCULOS!H:S,12,FALSE)","v":5}]
[3,"Infrastructuras y servicios","3.2","Infrastructuras básicas","3.2.3","Alumbrado público","ENERGÍA Y CAMBIO CLIMATIC","3.2.03.d",null,"¿Se dispone de Documentos oficiales que reflejan las principales características de la red de alumbrado publico (por ejemplo pliego condiciones técnicas de prestación de servicio)?","SI/NO","Surt de la Q","Vía pública",{"$f":"VLOOKUP(H107,CALCULOS!H:S,12,FALSE)","v":5}]
[3,"Infrastructuras y servicios","3.2","Infrastructuras básicas","3.2.3","Alumbrado público","ENERGÍA Y CAMBIO CLIMATIC","3.2.03.e",null,"¿Se dispone de planos de la red de alumbrado?","SI/NO","Surt de la Q","Vía pública",{"$f":"VLOOKUP(H108,CALCULOS!H:S,12,FALSE)","v":5}]
[3,"Infrastructuras y servicios","3.2","Infrastructuras básicas","3.2.3","Alumbrado público","ENERGÍA Y CAMBIO CLIMATIC","3.2.03.f",null,"Estado de conservación es adecuado, sin cableado al aire en cajas de conexiones y cuadros eléctricos públicos","Grad 1-5","Surt de la Q","Vía pública",{"$f":"VLOOKUP(H109,CALCULOS!H:S,12,FALSE)","v":5}]
[3,"Infrastructuras y servicios","3.2","Infrastructuras básicas","3.2.3","Alumbrado público","ENERGÍA Y CAMBIO CLIMATIC","3.2.03.g",null,"De ser requerido, hay elementos de alumbrado en zonas que requieren de visibilidad (paradas de transporte público...)","SI/NO","Surt de la Q","Vía pública",{"$f":"VLOOKUP(H110,CALCULOS!H:S,12,FALSE)","v":5}]
[3,"Infrastructuras y servicios","3.2","Infrastructuras básicas","3.2.3","Alumbrado público","ENERGÍA Y CAMBIO CLIMATIC","3.2.03.h",null,"¿Existe un protocolo definido con el titular de la infraestructura y éste se cumple?","SI/NO","Surt de la Q","Vía pública",{"$f":"VLOOKUP(H111,CALCULOS!H:S,12,FALSE)","v":5}]
[3,"Infrastructuras y servicios","3.2","Infrastructuras básicas","3.2.3","Alumbrado público","ENERGÍA Y CAMBIO CLIMATIC","3.2.03.i",null,"¿Está garantizada la adecuada visibilidad durante el horario de actividad habitual, de acuerdo con las circunstancias del entorno?","SI/NO","Surt de la Q","Vía pública",{"$f":"VLOOKUP(H112,CALCULOS!H:S,12,FALSE)","v":5}]
[3,"Infrastructuras y servicios","3.2","Infrastructuras básicas","3.2.4","Red eléctrica","ENERGÍA Y CAMBIO CLIMATIC","3.2.04.a",null,"¿Se dispone de Documentos oficiales que reflejan las principales características de la red/s de suministro energético (por ejemplo pliego condiciones técnicas de prestación de servicio)?","SI/NO","Surt de la Q","Vía pública",{"$f":"VLOOKUP(H113,CALCULOS!H:S,12,FALSE)","v":5}]
[3,"Infrastructuras y servicios","3.2","Infrastructuras básicas","3.2.4","Red eléctrica","ENERGÍA Y CAMBIO CLIMATIC","3.2.04.b",null,"¿Se dispone de Plano de las redes para el suministro energético?","SI/NO","Surt de la Q","Vía pública",{"$f":"VLOOKUP(H114,CALCULOS!H:S,12,FALSE)","v":5}]
[3,"Infrastructuras y servicios","3.2","Infrastructuras básicas","3.2.4","Red eléctrica","ENERGÍA Y CAMBIO CLIMATIC","3.2.04.c",null,"¿Se tiene el contrato/s de prestación de servicio de mantenimiento suministro energético (por ejemplo, adjudicación pública del servicio)?","SI/NO","Surt de la Q","Vía pública",{"$f":"VLOOKUP(H115,CALCULOS!H:S,12,FALSE)","v":5}]
[3,"Infrastructuras y servicios","3.2","Infrastructuras básicas","3.2.4","Red eléctrica","ENERGÍA Y CAMBIO CLIMATIC","3.2.04.d",null,"Estado de conservación de la red / redes de suministro energético","Grad 1-5",null,"Vía pública",{"$f":"VLOOKUP(H116,CALCULOS!H:S,12,FALSE)","v":5}]
[3,"Infrastructuras y servicios","3.2","Infrastructuras básicas","3.2.4","Red eléctrica","ENERGÍA Y CAMBIO CLIMATIC","3.2.04.e",null,"¿Se considera que la red/s de suministro energético adecuadamente dimensionadas y capaces de suministrar suficiente energía a todas las parcelas?","SI/NO",null,"Vía pública",{"$f":"VLOOKUP(H117,CALCULOS!H:S,12,FALSE)","v":5}]
[3,"Infrastructuras y servicios","3.2","Infrastructuras básicas","3.2.5","Infraestructuras viarias","MOVILIDAD","3.2.05.a",null,"Cercanía a red primaria de carreteras","Grad 1-5",null,"Vía pública",{"$f":"VLOOKUP(H118,CALCULOS!H:S,12,FALSE)","v":5}]
[3,"Infrastructuras y servicios","3.2","Infrastructuras básicas","3.2.5","Infraestructuras viarias","MOVILIDAD","3.2.05.b",null,"Existen elementos de pacificación (separadores, carriles, reductores de velocidad) en zonas de tráfico rápido y/o paso de personas","SI/NO",null,"Vía pública",{"$f":"VLOOKUP(H119,CALCULOS!H:S,12,FALSE)","v":5}]
[3,"Infrastructuras y servicios","3.2","Infrastructuras básicas","3.2.5","Infraestructuras viarias","MOVILIDAD","3.2.05.c","x","¿La red viaria al polígono está construida con materiales de alto índice de sostenibilidad?","SI/NO",null,"Vía pública",{"$f":"VLOOKUP(H120,CALCULOS!H:S,12,FALSE)","v":15},"Nuevos carreras y carreteras y reparaciones con materiales con etiqueta y certificaciones de sostenibilidad"]
[3,"Infrastructuras y servicios","3.2","Infrastructuras básicas","3.2.6","Servicios para la movilidad sostenible","MOVILIDAD","3.2.06.a",null,"¿Existen informes o propuestas para la mejora de la movilidad y/o la intermodalidad en el área? (Plan de movilidad específico o equivalente)","SI/NO",null,"Vía pública",{"$f":"VLOOKUP(H121,CALCULOS!H:S,12,FALSE)","v":10}]
[3,"Infrastructuras y servicios","3.2","Infrastructuras básicas","3.2.6","Servicios para la movilidad sostenible","MOVILIDAD","3.2.06.b","x","¿Se dispone de espacios de aparcamiento para vehículos de transporte de mercancías accesibles, claramente delimitados y señalizados?","SI/NO",null,"Vía pública",{"$f":"VLOOKUP(H122,CALCULOS!H:S,12,FALSE)","v":15},"Disponer de espacios reservados para el aparcamiento de camiones"]
[3,"Infrastructuras y servicios","3.2","Infrastructuras básicas","3.2.6","Servicios para la movilidad sostenible","MOVILIDAD","3.2.06.c","x","¿Existen políticas de aparcamiento para favorecer la movilidad sostenible?","SI/NO",null,"Vía pública",{"$f":"VLOOKUP(H123,CALCULOS!H:S,12,FALSE)","v":15},"Definir políticas de aparcamiento de vehículos que fomenten la movilidad sostenible dentro del PAE y para acceder a ellas desde las zonas más urbanas"]
[3,"Infrastructuras y servicios","3.2","Infrastructuras básicas","3.2.7","Transporte público","MOVILIDAD","3.2.07.a",null,"¿Se dispone de información disponible sobre el transporte público (líneas, recorridos, frecuencias...)?","SI/NO",null,"Vía pública",{"$f":"VLOOKUP(H124,CALCULOS!H:S,12,FALSE)","v":10}]
[3,"Infrastructuras y servicios","3.2","Infrastructuras básicas","3.2.7","Transporte público","MOVILIDAD","3.2.07.b",null,"Proximidad, accesibilidad y estado de conservación de paradas de transporte público","Grad 1-5",null,"Vía pública",{"$f":"VLOOKUP(H125,CALCULOS!H:S,12,FALSE)","v":10}]
[3,"Infrastructuras y servicios","3.2","Infrastructuras básicas","3.2.8","Recorridos a pie o bicicleta","MOVILIDAD","3.2.08.a","x","Adecuación de recorridos a pie o bicicleta","Grad 1-5",null,"Vía pública",{"$f":"VLOOKUP(H126,CALCULOS!H:S,12,FALSE)","v":15},"Adecuar recorridos seguros y agradables para fomentar el acceso a pie, bicicleta o similar"]
[3,"Infrastructuras y servicios","3.2","Infrastructuras básicas","3.2.9","Zonas verdes y espacios de ocio","CALIDAD DEL ESPACIO","3.2.09.a",null,"¿Se tiene Contrato de prestación de servicio de jardinería y zonas verdes y de ocio (por ejemplo, adjudicación pública del servicio)?","SI/NO","Surt de la Q","Vía pública",{"$f":"VLOOKUP(H127,CALCULOS!H:S,12,FALSE)","v":5}]
[3,"Infrastructuras y servicios","3.2","Infrastructuras básicas","3.2.9","Zonas verdes y espacios de ocio","CALIDAD DEL ESPACIO","3.2.09.b",null,"¿Se tienen documentos oficiales que reflejan las principales características de zonas verdes y de ocio (por ejemplo pliego condiciones técnicas de prestación de servicio)?","SI/NO","Surt de la Q","Vía pública",{"$f":"VLOOKUP(H128,CALCULOS!H:S,12,FALSE)","v":5}]
[3,"Infrastructuras y servicios","3.2","Infrastructuras básicas","3.2.9","Zonas verdes y espacios de ocio","CALIDAD DEL ESPACIO","3.2.09.c",null,"Accesibilidad de zonas verdes y espacios de ocio, sin barreras arquitectónicas y acceso en condiciones de seguridad","SI/NO","Surt de la Q","Vía pública",{"$f":"VLOOKUP(H129,CALCULOS!H:S,12,FALSE)","v":5}]
[3,"Infrastructuras y servicios","3.2","Infrastructuras básicas","3.2.9","Zonas verdes y espacios de ocio","CALIDAD DEL ESPACIO","3.2.09.d",null,"Estado de conservación y mantenimiento de zonas verdes y espacios de ocio","Grad 1-5","Surt de la Q","Vía pública",{"$f":"VLOOKUP(H130,CALCULOS!H:S,12,FALSE)","v":5}]
[3,"Infrastructuras y servicios","3.2","Infrastructuras básicas","3.2.9","Zonas verdes y espacios de ocio","CALIDAD DEL ESPACIO","3.2.09.e",null,"¿Existe información visible con los datos de contacto en caso de incidentes?","SI/NO","Surt de la Q","Vía pública",{"$f":"VLOOKUP(H131,CALCULOS!H:S,12,FALSE)","v":5}]
[3,"Infrastructuras y servicios","3.2","Infrastructuras básicas","3.2.9","Zonas verdes y espacios de ocio","CALIDAD DEL ESPACIO","3.2.09.f",null,"Los espacios verdes y de ocio son existentes y están habilitados para cada tipo de usuario (por edades, por finalidad, animales, etc) están adecuadamente delimitados e identificados, así como las normas de uso seguro de las instalaciones asignadas a cada uno de ellos?","SI/NO","Surt de la Q","Vía pública",{"$f":"VLOOKUP(H132,CALCULOS!H:S,12,FALSE)","v":5}]
[3,"Infrastructuras y servicios","3.2","Infrastructuras básicas","3.2.9","Zonas verdes y espacios de ocio","CALIDAD DEL ESPACIO","3.2.09.g","x","Existen espacios habilitados para el uso deportivo (bicicletas, patinaje, etc.) y están adecuadamente señalizados y delimitados en condiciones de seguridad para evitar accidentes con otros usuarios de los espacios","SI/NO","Surt de la Q","Vía pública",{"$f":"VLOOKUP(H133,CALCULOS!H:S,12,FALSE)","v":15},"Crear espacios de ocio y bienestar de uso deportivo pensado para trabajadores, correctamente acotados y mantenidos"]
[3,"Infrastructuras y servicios","3.2","Infrastructuras básicas","3.2.10","Infraest. por emergencias","SEGURIDAD","3.2.10.a",null,"¿Existe un punto de encuentro en una ubicación segura dentro del área empresarial, señalizado y accesible?","SI/NO","Surt de la Q","Vía pública",{"$f":"VLOOKUP(H134,CALCULOS!H:S,12,FALSE)","v":5}]
[3,"Infrastructuras y servicios","3.2","Infrastructuras básicas","3.2.10","Infraest. por emergencias","SEGURIDAD","3.2.10.b",null,"¿Existe señalización de emergencias y permite un adecuado desalojo en caso necesario?","SI/NO","Surt de la Q","Vía pública",{"$f":"VLOOKUP(H135,CALCULOS!H:S,12,FALSE)","v":5}]
[3,"Infrastructuras y servicios","3.2","Infrastructuras básicas","3.2.10","Infraest. por emergencias","SEGURIDAD","3.2.10.c",null,"¿Existen evidencias de realización de simulacros o pruebas en la red de emergencias, y de adecuación de ésta a las necesidades del área?","SI/NO","Surt de la Q","Vía pública",{"$f":"VLOOKUP(H136,CALCULOS!H:S,12,FALSE)","v":5}]
[3,"Infrastructuras y servicios","3.2","Infrastructuras básicas","3.2.10","Infraest. por emergencias","SEGURIDAD","3.2.10.d",null,"Hay red de hidrantes y está en buen estado de conservación","SI/NO","Surt de la Q","Vía pública",{"$f":"VLOOKUP(H137,CALCULOS!H:S,12,FALSE)","v":5}]
[3,"Infrastructuras y servicios","3.2","Infrastructuras básicas","3.2.10","Infraest. por emergencias","SEGURIDAD","3.2.10.e",null,"¿La señalización de las tomas de la red de hidrantes es adecuada para asegurar que no se obstruyen y son funcionales?","SI/NO","Surt de la Q","Vía pública",{"$f":"VLOOKUP(H138,CALCULOS!H:S,12,FALSE)","v":5}]
[3,"Infrastructuras y servicios","3.2","Infrastructuras básicas","3.2.10","Infraest. por emergencias","SEGURIDAD","3.2.10.f",null,"¿Se dispone de Plano de la red de hidrantes?","SI/NO","Surt de la Q","Vía pública",{"$f":"VLOOKUP(H139,CALCULOS!H:S,12,FALSE)","v":5}]
[3,"Infrastructuras y servicios","3.2","Infrastructuras básicas","3.2.10","Infraest. por emergencias","SEGURIDAD","3.2.10.g",null,"¿Se tiene Contrato con organización que lleva a cabo el mantenimiento de hidrantes según la legislación vigente?","SI/NO","Surt de la Q","Vía pública",{"$f":"VLOOKUP(H140,CALCULOS!H:S,12,FALSE)","v":5}]
[3,"Infrastructuras y servicios","3.2","Infrastructuras básicas","3.2.10","Infraest. por emergencias","SEGURIDAD","3.2.10.h",null,"¿Se dispone de Documentos oficiales que reflejan las principales características de la red de hidrantes (por ejemplo pliego condiciones técnicas de prestación de servicio)?","SI/NO","Surt de la Q","Vía pública",{"$f":"VLOOKUP(H141,CALCULOS!H:S,12,FALSE)","v":5}]
[3,"Infrastructuras y servicios","3.2","Infrastructuras básicas","3.2.10","Infraest. por emergencias","SEGURIDAD","3.2.10.i",null,"¿Se dispone de registros mantenimiento que evidencien la puesta en marcha periódica y mantenimiento de la red de hidrantes según establece el RD 513/2017?","SI/NO","Surt de la Q","Vía pública",{"$f":"VLOOKUP(H142,CALCULOS!H:S,12,FALSE)","v":5}]
[3,"Infrastructuras y servicios","3.2","Infrastructuras básicas","3.2.11","Telecomunicaciones","TELECOMUNICACIONES","3.2.11.a","x","¿Llega cobertura de Fibra Óptica en el PAE?","SI/NO",null,"Vía pública",{"$f":"VLOOKUP(H143,CALCULOS!H:S,12,FALSE)","v":15},"Fomentar la extensión de la fibra óptica en todo el PAE"]
[3,"Infrastructuras y servicios","3.2","Infrastructuras básicas","3.2.11","Telecomunicaciones","TELECOMUNICACIONES","3.2.11.b",null,"Existe cobertura para servicios móviles en toda el área.","SI/NO","Surt de la Q","Vía pública",{"$f":"VLOOKUP(H144,CALCULOS!H:S,12,FALSE)","v":5}]
[3,"Infrastructuras y servicios","3.2","Infrastructuras básicas","3.2.11","Telecomunicaciones","TELECOMUNICACIONES","3.2.11.c","x","¿Existe cobertura móvil de alta velocidad 4G+, 5G?","Grad 1-5","Surt de la Q","Vía pública",{"$f":"VLOOKUP(H145,CALCULOS!H:S,12,FALSE)","v":15},"Fomentar la cobertura móvil de alta velocidad, preferiblemente 5G, en todo el PAE"]
[3,"Infrastructuras y servicios","3.2","Infrastructuras básicas","3.2.11","Telecomunicaciones","TELECOMUNICACIONES","3.2.11.d",null,"Grado de despliegue y velocidad de la red telecomunicaciones en el PAE","Grad 1-5","Surt de la Q","Vía pública",{"$f":"VLOOKUP(H146,CALCULOS!H:S,12,FALSE)","v":5}]
[3,"Infrastructuras y servicios","3.2","Infrastructuras básicas","3.2.11","Telecomunicaciones","TELECOMUNICACIONES","3.2.11.e",null,"Las antenas repetidoras de señal en zonas públicas (en su caso) están señalizadas y con acceso controlado","SI/NO","Surt de la Q","Vía pública",{"$f":"VLOOKUP(H147,CALCULOS!H:S,12,FALSE)","v":5}]
[3,"Infrastructuras y servicios","3.2","Infrastructuras básicas","3.2.11","Telecomunicaciones","TELECOMUNICACIONES","3.2.11.f",null,"Las información sobre las características de la red de comunicaciones aparecen adecuadamente reflejadas en la publicidad del área","SI/NO","Surt de la Q","Vía pública",{"$f":"VLOOKUP(H148,CALCULOS!H:S,12,FALSE)","v":5}]
[3,"Infrastructuras y servicios","3.2","Infrastructuras básicas","3.2.11","Telecomunicaciones","TELECOMUNICACIONES","3.2.11.g",null,"¿Se dispone de Documentos oficiales que reflejan las principales características de la red telecomunicaciones (por ejemplo pliego condiciones técnicas de prestación de servicio)?","SI/NO","Surt de la Q","Vía pública",{"$f":"VLOOKUP(H149,CALCULOS!H:S,12,FALSE)","v":5}]
[3,"Infrastructuras y servicios","3.2","Infrastructuras básicas","3.2.11","Telecomunicaciones","TELECOMUNICACIONES","3.2.11.h",null,"Estado de conservación de elementos visibles de la red de comunicaciones. Especialmente, en su caso, las casetas o cajas de conexiones","Grad 1-5","Surt de la Q","Vía pública",{"$f":"VLOOKUP(H150,CALCULOS!H:S,12,FALSE)","v":5}]
[3,"Infrastructuras y servicios","3.2","Infrastructuras básicas","3.2.11","Telecomunicaciones","TELECOMUNICACIONES","3.2.11.i",null,"¿Se tiene el contrato de prestación de servicio de telecomunicaciones (por ejemplo, adjudicación pública del servicio)?","SI/NO","Surt de la Q","Vía pública",{"$f":"VLOOKUP(H151,CALCULOS!H:S,12,FALSE)","v":5}]
[3,"Infrastructuras y servicios","3.2","Infrastructuras básicas","3.2.11","Telecomunicaciones","TELECOMUNICACIONES","3.2.11.j",null,"¿Se dispone de Plano de canalizaciones (de ser el caso, por proveedor)?","SI/NO","Surt de la Q","Vía pública",{"$f":"VLOOKUP(H152,CALCULOS!H:S,12,FALSE)","v":5}]
[3,"Infrastructuras y servicios","3.2","Infrastructuras básicas","3.2.11","Telecomunicaciones","TELECOMUNICACIONES","3.2.11.k",null,"¿Se dispone de registro de incidencias (graves) en la infraestructura?","SI/NO","Surt de la Q","Vía pública",{"$f":"VLOOKUP(H153,CALCULOS!H:S,12,FALSE)","v":5}]
[3,"Infrastructuras y servicios","3.3","Serveis avançats i/o compartits","3.3.1","financiación","COLABORACIÓN","3.3.01.a","x","¿Se ofrecen servicios especiales de financiación a las empresas? (Gestor financiero)","SI/NO","Surt de la Q","Asociación o entidad de gestión",{"$f":"VLOOKUP(H154,CALCULOS!H:S,12,FALSE)","v":15},"Ofrecer un servicio de gestor financiero a las empresas del PAE"]
[3,"Infrastructuras y servicios","3.3","Servicios avanzados y/o compartidos","3.3.2","Asistencia a la innovación","COLABORACIÓN","3.3.02.a","x","¿Se ofrece servicio para ayudar a las empresas a innovar?","SI/NO",null,"Promoción económica",{"$f":"VLOOKUP(H155,CALCULOS!H:S,12,FALSE)","v":15},"Ofrecer un servicio de asistencia a la innovación en las empresas del PAE"]
[3,"Infrastructuras y servicios","3.3","Servicios avanzados y/o compartidos","3.3.3","Centro de servicios","COLABORACIÓN","3.3.03.a","x","¿Existe un centro físico/oficina/oficina virtual de servicios?","SI/NO",null,"Asociación o entidad de gestión",{"$f":"VLOOKUP(H156,CALCULOS!H:S,12,FALSE)","v":15},"Implusar y crear un centro de servicios en las empresas desde la gestión del PAE (oficina física o virtual)"]
[3,"Infrastructuras y servicios","3.3","Servicios avanzados y/o compartidos","3.3.4","Gestor energética/ambiental","ENERGÍA Y CAMBIO CLIMATIC","3.3.04.a","x","¿Se promociona la energía compartida desde la gestión del PAE?","SI/NO",null,"Medio Ambiente",{"$f":"VLOOKUP(H157,CALCULOS!H:S,12,FALSE)","v":15},"Promover las iniciativas de energía compartida"]
[3,"Infrastructuras y servicios","3.3","Servicios avanzados y/o compartidos","3.3.4","Gestor energética/ambiental","ENERGÍA Y CAMBIO CLIMATIC","3.3.04.b","x","¿Se ofrece una central de compras en materia energética (placas solares, comprar verde energética, etc)?","SI/NO",null,"Asociación o entidad de gestión",{"$f":"VLOOKUP(H158,CALCULOS!H:S,12,FALSE)","v":15},"Crear una central de compras de energía (placas solares, energía verde certificada, biomasa, etc)"]
[3,"Infrastructuras y servicios","3.3","Servicios avanzados y/o compartidos","3.3.4","Gestor energética/ambiental","ENERGÍA Y CAMBIO CLIMATIC","3.3.04.c","x","¿Existe la figura del gestor energético y/o gestor ambiental?","SI/NO",null,"Asociación o entidad de gestión",{"$f":"VLOOKUP(H159,CALCULOS!H:S,12,FALSE)","v":15},"Ofrecer un servicio de gestión energética y/o ambiental"]
[3,"Infrastructuras y servicios","3.3","Servicios avanzados y/o compartidos","3.3.5","Servicios para la movilidad sostenible","MOVILIDAD","3.3.05.a","x","¿Se ha puesto en marcha o implulsado algún servicio de vehículos compartidos? (Carsharing, bicicletas compartidas, motocicletas eléctricas, patinetes…)","SI/NO","Surt de la Q","Medio Ambiente",{"$f":"VLOOKUP(H160,CALCULOS!H:S,12,FALSE)","v":15},"Poner en marcha o impulsar un servicio de vehículos compartidos (Carsharing, bicicletas compartidas, motocicletas eléctricas, patinetes…)"]
[3,"Infrastructuras y servicios","3.3","Servicios avanzados y/o compartidos","3.3.6","Servicios a la exportación","MOVILIDAD","3.3.06.a","x","¿Se ofrecen servicios para facilitar la distribución de mercancías?","SI/NO","Surt de la Q","Asociación o entidad de gestión",{"$f":"VLOOKUP(H161,CALCULOS!H:S,12,FALSE)","v":15},"Crear iniciativas para una distribución eficiente y sostenible de mercancías tanto de entrada como internas como de salida del PAE"]
[3,"Infrastructuras y servicios","3.3","Servicios avanzados y/o compartidos","3.3.7","Mensajería y logística","MOVILIDAD","3.3.07.a","x","¿Se dispone de servicio mancomunado de mensajería?","SI/NO","Surt de la Q","Asociación o entidad de gestión",{"$f":"VLOOKUP(H162,CALCULOS!H:S,12,FALSE)","v":15},"Ofrecer un servicio agregado o mancomunado de mensajería"]
[3,"Infrastructuras y servicios","3.3","Servicios avanzados y/o compartidos","3.3.7","Mensajería y logística","MOVILIDAD","3.3.07.b","x","¿Se dispone de servicios logísticos compartidos o integrados?","SI/NO","Surt de la Q","Asociación o entidad de gestión",{"$f":"VLOOKUP(H163,CALCULOS!H:S,12,FALSE)","v":15},"Impulsar y/o fomentar servicios logísticos compartidos o integrados"]
[3,"Infrastructuras y servicios","3.3","Servicios avanzados y/o compartidos","3.3.8","Movilidad compartida","MOVILIDAD","3.3.08.a","x","¿Se ofrece o promociona algún sistema o plataforma de movilidad compartida por trabajadores?","SI/NO","Surt de la Q","Asociación o entidad de gestión",{"$f":"VLOOKUP(H164,CALCULOS!H:S,12,FALSE)","v":15},"Ofrecer y/o promocionar algún sistema de movilidad compartida por trabajadores del PAE"]
[3,"Infrastructuras y servicios","3.3","Servicios avanzados y/o compartidos","3.3.9","Mantenimiento de parcelas vacías","CALIDAD DEL ESPACIO","3.3.09.a","x","¿Se tiene una relación de las parcelas vacías y ubicación en planos?","SI/NO","Surt de la Q","Asociación o entidad de gestión",{"$f":"VLOOKUP(H165,CALCULOS!H:S,12,FALSE)","v":15},"Disponer de cartografía actualizada de parcelas vacías, en el sentido de disponer de un servicio de gestión de ofertas y demandas."]
[3,"Infrastructuras y servicios","3.3","Servicios avanzados y/o compartidos","3.3.9","Mantenimiento de parcelas vacías","CALIDAD DEL ESPACIO","3.3.09.b","x","¿Se tienen registros asociados al mantenimiento de parcelas (por ejemplo, limpieza de maleza, residuos etc.)?","SI/NO","Surt de la Q","Asociación o entidad de gestión",{"$f":"VLOOKUP(H166,CALCULOS!H:S,12,FALSE)","v":15},"Registrar las actuaciones de mantenimiento de parcelas relacionadas con la limpieza, malas hierbas, limpieza de vertidos incontrolados de residuos, etc"]
[3,"Infrastructuras y servicios","3.3","Servicios avanzados y/o compartidos","3.3.9","Mantenimiento de parcelas vacías","CALIDAD DEL ESPACIO","3.3.09.c","x","Estado de las parcelas vacías","Grad 1-5","Surt de la Q","Asociación o entidad de gestión",{"$f":"VLOOKUP(H167,CALCULOS!H:S,12,FALSE)","v":15},"Velar por un correcto mantenimiento de las parcelas vacías por una mejora de la imagen, seguridad, evitar plagas, etc."]
[3,"Infrastructuras y servicios","3.3","Servicios avanzados y/o compartidos","3.3.9","Mantenimiento de parcelas vacías","CALIDAD DEL ESPACIO","3.3.09.d","x","Existen acuerdos con los titulares de las parcelas para su mantenimiento o, en su defecto, con administración competente","SI/NO","Surt de la Q","Asociación o entidad de gestión",{"$f":"VLOOKUP(H168,CALCULOS!H:S,12,FALSE)","v":15},"Crear acuerdos con los titulares de parcelas para su mantenimiento"]
[3,"Infrastructuras y servicios","3.3","Servicios avanzados y/o compartidos","3.3.9","Mantenimiento de parcelas vacías","CALIDAD DEL ESPACIO","3.3.09.e","x","¿Están las parcelas vacías cerradas al acceso al público?","SI/NO","Surt de la Q","Vía pública",{"$f":"VLOOKUP(H169,CALCULOS!H:S,12,FALSE)","v":15},"Velar por que las parcelas vacías estén cerradas al público"]
[3,"Infrastructuras y servicios","3.3","Servicios avanzados y/o compartidos","3.3.10","Espacios de bienestar (servicios a las personas)","CALIDAD DEL ESPACIO","3.3.10.a","x","¿Existen espacios de bienestar para personas tales como gimnasio, espacios de ocio, fisioterapia…?","SI/NO","Propi, revisat segons llei APEU","Asociación o entidad de gestión",{"$f":"VLOOKUP(H170,CALCULOS!H:S,12,FALSE)","v":15},"Promoción de espacios y servicios de bienestar por las personas (pensado por trabajadores y familiares), como espacios de ocio, gimnasio, fisioterapia, etc."]
[3,"Infrastructuras y servicios","3.3","Servicios avanzados y/o compartidos","3.3.11","Bolsa de subproductos/desechería industrial","RESIDUOS","3.3.11.a","x","¿Existe bolsa de subproductos?","SI/NO","Propi, revisat segons llei APEU","Asociación o entidad de gestión",{"$f":"VLOOKUP(H171,CALCULOS!H:S,12,FALSE)","v":15},"Crear, impulsar o inscribirse en un servicio de bolsa de subproductos y recursos industriales"]
[3,"Infrastructuras y servicios","3.3","Servicios avanzados y/o compartidos","3.3.11","Bolsa de subproductos/desechería industrial","RESIDUOS","3.3.11.b","x","¿Existe scrap-store o similar?","SI/NO","Propi, revisat segons llei APEU","Asociación o entidad de gestión",{"$f":"VLOOKUP(H172,CALCULOS!H:S,12,FALSE)","v":15},"Crear, impulsar o inscribirse en un servicio de Scrap-Store o similar"]
[3,"Infrastructuras y servicios","3.3","Servicios avanzados y/o compartidos","3.3.11","Bolsa de subproductos/desechería industrial","RESIDUOS","3.3.11.c","x","¿Existe centro de recogida industrial?","SI/NO","Propi, revisat segons llei APEU","Asociación o entidad de gestión",{"$f":"VLOOKUP(H173,CALCULOS!H:S,12,FALSE)","v":15},"Crear, impulsar o inscribirse a un servicio de Punto verde industrial"]
[3,"Infrastructuras y servicios","3.3","Servicios avanzados y/o compartidos","3.3.12","Seguridad y emergencias","SEGURIDAD","3.3.12.a","x","¿El área empresarial cuenta con presencia de fuerzas y cuerpos de seguridad o de servicio de vigilancia privada?","SI/NO","Propi, revisat segons llei APEU","Asociación o entidad de gestión",{"$f":"VLOOKUP(H174,CALCULOS!H:S,12,FALSE)","v":15},"Disponer de un servicio de seguridad y/o vigilancia pública o privada específica por el PAE"]
[3,"Infrastructuras y servicios","3.3","Servicios avanzados y/o compartidos","3.3.12","Seguridad y emergencias","SEGURIDAD","3.3.12.b","x","¿Se ha comunicado el plan de actuación frente a emergencias a empresas del área y terceros potencialmente afectados sobre su contenido? ¿Se tienen evidencias de estas comunicaciones?","Grad 1-5",null,"Asociación o entidad de gestión",{"$f":"VLOOKUP(H175,CALCULOS!H:S,12,FALSE)","v":15},"Elaborar y mantener un Plan de Emergencias del PAE y realizar las correspondientes comunicaciones a las empresas"]
[3,"Infrastructuras y servicios","3.3","Servicios avanzados y/o compartidos","3.3.12","Seguridad y emergencias","SEGURIDAD","3.3.12.c","x","¿Se han realizado simulacros de puesta en marcha el plan de emergencia en el último año? ¿Se han puesto en marcha las infraestructuras de emergencia? (RECOMENDACIÓN)","SI/NO",null,"Policía y protección civil",{"$f":"VLOOKUP(H176,CALCULOS!H:S,12,FALSE)","v":15},"Realizar simulacros de Emergencias tales como seísmos, incendios, inundaciones, emergencia química, etc."]
[3,"Infrastructuras y servicios","3.3","Servicios avanzados y/o compartidos","3.3.12","Seguridad y emergencias","SEGURIDAD","3.3.12.d","x","¿Se tiene un Plan de emergencias en versión actualizada y con los contenidos indicados en el referencial Marca Q?","SI/NO",null,"Policía y protección civil",{"$f":"VLOOKUP(H177,CALCULOS!H:S,12,FALSE)","v":15},"Elaborar y mantener un Plan de Emergencias del PAE y realizar las correspondientes comunicaciones a las empresas"]
[3,"Infrastructuras y servicios","3.3","Servicios avanzados y/o compartidos","3.3.12","Seguridad y emergencias","SEGURIDAD","3.3.12.e","x","Grado de coordinación de la vigilancia privada y conocimiento del procedimiento de actuación frente a incidentes","Grad 1-5",null,"Policía y protección civil",{"$f":"VLOOKUP(H178,CALCULOS!H:S,12,FALSE)","v":15},"Realizar la correspondiente formación y coordinación con los responsables de la vigilancia privada (en su caso), protección civil, policía local, etc. En relación a posibles emergencias en el PAE"]
[3,"Infrastructuras y servicios","3.3","Servicios avanzados y/o compartidos","3.3.12","Seguridad y emergencias","SEGURIDAD","3.3.12.f","x","Definición clara de responsabilidades en relación con el plan de actuación ante emergencias vigente","SI/NO",null,"Policía y protección civil",{"$f":"VLOOKUP(H179,CALCULOS!H:S,12,FALSE)","v":15},"Definir claramente las responsabilidades ante una emergencia en el PAE (normalmente, definidas en el Plan de Emergencia)"]
[3,"Infrastructuras y servicios","3.3","Servicios avanzados y/o compartidos","3.3.12","Seguridad y emergencias","SEGURIDAD","3.3.12.g","x","Grado de funcionamiento y mantenimiento de las instalaciones de vigilancia","Grad 1-5",null,"Policía y protección civil",{"$f":"VLOOKUP(H180,CALCULOS!H:S,12,FALSE)","v":15},"Disponer de elementos técnicos para la vigilancia del PAE en buen estado de funcionamiento y mantenimiento (p.ej. pilones por control de tráfico, videovigilancia, iluminación de seguridad, radio…)"]
[3,"Infrastructuras y servicios","3.3","Servicios avanzados y/o compartidos","3.3.12","Seguridad y emergencias","SEGURIDAD","3.3.12.h","x","¿Se realizan simulacros de emergencia con periodicidad adecuada y se analiza la información obtenida para la mejora?","SI/NO",null,"Policía y protección civil",{"$f":"VLOOKUP(H181,CALCULOS!H:S,12,FALSE)","v":15},"Realizar simulacros de Emergencias y analizar sus resultados para mejorar el Plan de Emergencia"]
[3,"Infrastructuras y servicios","3.3","Servicios avanzados y/o compartidos","3.3.12","Seguridad y emergencias","SEGURIDAD","3.3.12.i","x","¿Existen un servicio central que centralice la gestión de emergencias en el PAE?","SI/NO",null,"Policía y protección civil",{"$f":"VLOOKUP(H182,CALCULOS!H:S,12,FALSE)","v":15},"Disponer de un centro, servicio o responsable que centralice la gestión de emergencias en el PAE"]
[3,"Infrastructuras y servicios","3.4","Servicios básicos","3.4.1","Transporte público","MOVILIDAD","3.4.1.b",null,"Grado de proximidad y competitividad del transporte público (llega, frecuencia, rapidez, competitividad…)","Grad 1-5",null,"Vía pública",{"$f":"VLOOKUP(H183,CALCULOS!H:S,12,FALSE)","v":10}]
[3,"Infrastructuras y servicios","3.4","Servicios básicos","3.4.2","Limpieza vial","CALIDAD DEL ESPACIO","3.4.2.a",null,"¿Se tiene contrato (en caso de corresponder la gestión en el área) con la empresa proveedora del servicio de limpieza?","SI/NO",null,"Vía pública",{"$f":"VLOOKUP(H184,CALCULOS!H:S,12,FALSE)","v":5}]
[3,"Infrastructuras y servicios","3.4","Servicios básicos","3.4.2","Limpieza vial","CALIDAD DEL ESPACIO","3.4.2.b",null,"¿Existen Informes o propuestas de mejora enviadas a concesionario de limpieza, si las hubiere?","SI/NO",null,"Vía pública",{"$f":"VLOOKUP(H185,CALCULOS!H:S,12,FALSE)","v":5}]
[3,"Infrastructuras y servicios","3.4","Servicios básicos","3.4.2","Limpieza vial","CALIDAD DEL ESPACIO","3.4.2.c",null,"Grado de conservación de las zonas verdes dentro del área empresarial","Grad 1-5",null,"Vía pública",{"$f":"VLOOKUP(H186,CALCULOS!H:S,12,FALSE)","v":5}]
[3,"Infrastructuras y servicios","3.4","Servicios básicos","3.4.2","Limpieza vial","CALIDAD DEL ESPACIO","3.4.2.d",null,"Grado de limpieza del espacio público del área empresarial","Grad 1-5",null,"Vía pública",{"$f":"VLOOKUP(H187,CALCULOS!H:S,12,FALSE)","v":5}]
[3,"Infrastructuras y servicios","3.4","Servicios básicos","3.4.2","Limpieza vial","CALIDAD DEL ESPACIO","3.4.2.e",null,"¿Los períodos de prestación de servicio son adecuados a la tipología del área ya las necesidades de las empresas?","SI/NO",null,"Vía pública",{"$f":"VLOOKUP(H188,CALCULOS!H:S,12,FALSE)","v":5}]
[4,"Integración ambiental y riesgos","4.1","Contaminación luminosa","4.1.1","Alumbrado adaptado","CALIDAD DEL ESPACIO","4.1.1.a",null,"Proporción de alumbrado adpatado a normativa (%)","Grad 1-5",null,"Vía pública",{"$f":"VLOOKUP(H189,CALCULOS!H:S,12,FALSE)","v":10}]
[4,"Integración ambiental y riesgos","4.1","Contaminación luminosa","4.1.1","Alumbrado adaptado","CALIDAD DEL ESPACIO","4.1.1.b",null,"¿Existe mapa de protección frente a la contaminación luminosa (zonas E1, E2, E3, E4) disponible y actualizado?","SI/NO",null,"Urbanismo",{"$f":"VLOOKUP(H190,CALCULOS!H:S,12,FALSE)","v":10}]
[4,"Integración ambiental y riesgos","4.2","Emisiones atmosféricas","4.2.1","Control de emisiones atmosféricas","ENERGÍA Y CAMBIO CLIMATIC","4.2.1.b","x","¿Existe estación de medida de inmisión de contaminantes atmosféricos?","SI/NO",null,"Medio Ambiente",{"$f":"VLOOKUP(H191,CALCULOS!H:S,12,FALSE)","v":15},"Disponer de una estación de medida de inmisión de contaminantes atmosféricos (CO, PM10, Nox, SO2, etc)"]
[4,"Integración ambiental y riesgos","4.2","Emisiones atmosféricas","4.2.2","Calidad del aire","ENERGÍA Y CAMBIO CLIMATIC","4.2.2.c","x","¿Existe información de proximidad disponible sobre sobre calidad del aire: PST, NO2, CO, O3?","SI/NO",null,"Vía pública",{"$f":"VLOOKUP(H192,CALCULOS!H:S,12,FALSE)","v":15},"Disponer de información sobre la calidad del aire, a partir de una estación de medida en el PAE o en sus proximidades"]
[4,"Integración ambiental y riesgos","4.3","Inundabilidad","4.3.1","Afectación por zonas inundables","SEGURIDAD","4.3.1.a",null,"Proporción de superficie del PAE afectada por riesgo de inundación","Grad 1-5",null,"Policía y protección civil",{"$f":"VLOOKUP(H193,CALCULOS!H:S,12,FALSE)","v":5}]
[4,"Integración ambiental y riesgos","4.3","Inundabilidad","4.3.2","Afectación por zonas inundables","SEGURIDAD","4.3.2.b",null,"Grado de adecuación de los elementos de protección contra inundaciones","Grad 1-5",null,"Policía y protección civil",{"$f":"VLOOKUP(H194,CALCULOS!H:S,12,FALSE)","v":5}]
[4,"Integración ambiental y riesgos","4.4","Medio natural","4.4.1","Integración en el entorno natural","CALIDAD DEL ESPACIO","4.4.1.a","x","¿Se ha realizado un estudio de necesidad de pases de fauna? En caso de existir o ser necesarios, ¿son adecuados?","SI/NO",null,"Medio Ambiente",{"$f":"VLOOKUP(H195,CALCULOS!H:S,12,FALSE)","v":15},"Evaluar y la necesidad y, en su caso, crear pasos de fauna para garantizar la conectividad ecológica"]
[4,"Integración ambiental y riesgos","4.4","Medio natural","4.4.1","Integración en el entorno natural","SEGURIDAD","4.4.1.b","x","¿Se mantiene el control de perimetros de protección/franjas por control riesgo incendio forestal?","SI/NO",null,"Medio Ambiente",{"$f":"VLOOKUP(H196,CALCULOS!H:S,12,FALSE)","v":15},"Mantenimiento de los perimetros de protección/franjas por control riesgo incendio forestal"]
[4,"Integración ambiental y riesgos","4.4","Medio natural","4.4.1","Integración en el entorno natural","CALIDAD DEL ESPACIO","4.4.1.c","x","¿Se han realizado estudios de afectación en la fauna?","SI/NO",null,"Medio Ambiente",{"$f":"VLOOKUP(H197,CALCULOS!H:S,12,FALSE)","v":15},"En el caso de PAE no delimitados por trama urbana, disponer de información y/o estudios sobre posibles afectaciones a la fauna por la circulación de vehículos, emnisiones atmosféricas, ruidos o contaminación luminosa"]
[4,"Integración ambiental y riesgos","4.4","Medio natural","4.4.1","Integración en el entorno natural","CALIDAD DEL ESPACIO","4.4.1.d","x","¿Existen, en caso de ser necesarias, medidas de protección en fauna (aves nidificantes, protección de zonas especiales, control de ruido, control iluminación, etc.)?","SI/NO",null,"Medio Ambiente",{"$f":"VLOOKUP(H198,CALCULOS!H:S,12,FALSE)","v":15},"En caso de ser consideradas necesarias en estudios previos, crear medidas de protección en fauna (aves nidificantes, protección de zonas especiales, control de ruido, control iluminación, etc.)"]
[4,"Integración ambiental y riesgos","4.5","Paisaje","4.5.1","Grado de calidad del paisaje e integración del PAE","CALIDAD DEL ESPACIO","4.5.1.a","x","Grado de integración del PAE en el paisaje","Grad 1-5",null,"Medio Ambiente",{"$f":"VLOOKUP(H199,CALCULOS!H:S,12,FALSE)","v":15},"Realizar acciones para fomentar la integración paisajística de las construcciones y la morfología general del PAE en el paisaje"]
[4,"Integración ambiental y riesgos","4.5","Paisaje","4.5.1","Grado de calidad del paisaje e integración del PAE","CALIDAD DEL ESPACIO","4.5.1.b","x","¿Nivel de adecuación del PAE para permitir el disfrute del paisaje?","Grad 1-5",null,"Medio Ambiente",{"$f":"VLOOKUP(H200,CALCULOS!H:S,12,FALSE)","v":15},"Realizar acciones para fomentar que las personas dentro del entorno del PAE tengan una buena percepción del paisaje (acciones como ajardinamiento, eliminación de zonas banales, permitir visuales en el paisaje del entorno, miradores, etc)"]
[4,"Integración ambiental y riesgos","4.5","Paisaje","4.5.1","Grado de calidad del paisaje e integración del PAE","CALIDAD DEL ESPACIO","4.5.1.c","x","¿Se dispone de información sobre el Patrimonio industrial/cultural, de sus valores y las necesidades de preservación (en su caso)?","SI/NO",null,"Medio Ambiente",{"$f":"VLOOKUP(H201,CALCULOS!H:S,12,FALSE)","v":15},"Disponer de información sobre la existencia de Patrimonio Industrial o Cultural y, en caso de que exista, disponer de información sobre sus necesidades de preservación y/o recuperación"]
[4,"Integración ambiental y riesgos","4.5","Paisaje","4.5.1","Grado de calidad del paisaje e integración del PAE","CALIDAD DEL ESPACIO","4.5.1.d",null,"¿Se ha realizado alguna gestión por el mantenimiento del patrimonio industrial/cultural?","SI/NO",null,"Medio Ambiente",{"$f":"VLOOKUP(H202,CALCULOS!H:S,12,FALSE)","v":10}]
[4,"Integración ambiental y riesgos","4.6","Ruido","4.6.1","Protección contra el ruido","CALIDAD DEL ESPACIO","4.6.1.a",null,"¿Existe mapa de zonificación acústica actualizado y disponible?","SI/NO",null,"Urbanismo",{"$f":"VLOOKUP(H203,CALCULOS!H:S,12,FALSE)","v":10}]
[4,"Integración ambiental y riesgos","4.6","Ruido","4.6.1","Protección contra el ruido","CALIDAD DEL ESPACIO","4.6.1.b",null,"En caso necesario, ¿existen pantallas acústicas o similares para la protección contra el ruido?","SI/NO",null,"Medio Ambiente",{"$f":"VLOOKUP(H204,CALCULOS!H:S,12,FALSE)","v":10}]
[4,"Integración ambiental y riesgos","4.6","Ruido","4.6.1","Protección contra el ruido","CALIDAD DEL ESPACIO","4.6.1.c","x","¿La vialidad está construida con asfalto sonorreductor o medidas equivalentes?","SI/NO",null,"Vía pública",{"$f":"VLOOKUP(H205,CALCULOS!H:S,12,FALSE)","v":15},"Nuevos carreras y carreteras y reparaciones con materiales sonoreductores o medidas similares"]
[4,"Integración ambiental y riesgos","4.6","Ruido","4.6.1","Protección contra el ruido","CALIDAD DEL ESPACIO","4.6.1.d","x","¿Se realizan controles de ruido o existe algún tipo de servicio por su control?","SI/NO",null,"Medio Ambiente",{"$f":"VLOOKUP(H206,CALCULOS!H:S,12,FALSE)","v":15},"Realizar acciones de medida del ruido (inmisión) y/o crear o poder acceder a un servicio para su control de acuerdo a la legislación."]
[5,"Urbanismo","5.1","Características de las parcelas","5.1.1","Grado de ocupación de los PAE","SUELO","5.1.1.a",null,"Grado de ocupación de los PAE (%)","Grad 1-5",null,"Urbanismo",{"$f":"VLOOKUP(H207,CALCULOS!H:S,12,FALSE)","v":5}]
[5,"Urbanismo","5.1","Características de las parcelas","5.1.2","Titularidad de las parcelas vacantes y grado de comercialización","SUELO","5.1.2.a",null,"Titularidad del parque. vacantes y grado de comercialización","Grad 1-5",null,"Urbanismo",{"$f":"VLOOKUP(H208,CALCULOS!H:S,12,FALSE)","v":5}]
[5,"Urbanismo","5.1","Características de las parcelas","5.1.3","Tipología de las parcelas","SUELO","5.1.3.a",null,"Tipología de las parcelas según dimensiones (variabilidad, disponibilidad y flexibilidad de modificación)","Grad 1-5",null,"Urbanismo",{"$f":"VLOOKUP(H209,CALCULOS!H:S,12,FALSE)","v":5}]
[5,"Urbanismo","5.1","Características de las parcelas","5.1.4","Capacidad de expansión de implantaciones actuales","SUELO","5.1.4.a",null,"Capacidad de expansión de las actividades actuales","Grad 1-5",null,"Urbanismo",{"$f":"VLOOKUP(H210,CALCULOS!H:S,12,FALSE)","v":5}]
[5,"Urbanismo","5.1","Características de las parcelas","5.1.5","Tipología de las edificaciones","SUELO","5.1.5.a",null,"Edad promedio de las edificaciones actuales y necesidad de renovación","Grad 1-5",null,"Urbanismo",{"$f":"VLOOKUP(H211,CALCULOS!H:S,12,FALSE)","v":5}]
[5,"Urbanismo","5.2","Emplazamiento","5.2.1","Acceso desde Áreas Residenciales","MOVILIDAD","5.2.1.a",null,"Grado de proximidad a Áreas Residenciales","Grad 1-5",null,"Urbanismo",{"$f":"VLOOKUP(H212,CALCULOS!H:S,12,FALSE)","v":5}]
[5,"Urbanismo","5.2","Emplazamiento","5.2.1","Acceso desde Áreas Industriales","MOVILIDAD","5.2.1.b",null,"Grado de proximidad a otras áreas industriales","Grad 1-5",null,"Urbanismo",{"$f":"VLOOKUP(H213,CALCULOS!H:S,12,FALSE)","v":5}]
[5,"Urbanismo","5.2","Emplazamiento","5.2.2","Estado favorable de la tramitación urbanística","SUELO","5.2.2.a",null,"Estado del planeamiento y su tramitación","Grad 1-5",null,"Urbanismo",{"$f":"VLOOKUP(H214,CALCULOS!H:S,12,FALSE)","v":5}]
[5,"Urbanismo","5.2","Emplazamiento","5.2.3","Capacidad de ampliación","SUELO","5.2.3.a",null,"¿El PAE tiene posibilidades de ampliación?","SI/NO",null,"Urbanismo",{"$f":"VLOOKUP(H215,CALCULOS!H:S,12,FALSE)","v":5}]
[5,"Urbanismo","5.2","Emplazamiento","5.2.4","Equipamientos, Zonas verdes y Servicios Técnicos","SUELO","5.2.4.a",null,"¿Se han cumplido y todavía están disponibles las reservas urbanísticas por equipamientos y servicios técnicos?","SI/NO",null,"Urbanismo",{"$f":"VLOOKUP(H216,CALCULOS!H:S,12,FALSE)","v":5}]
[5,"Urbanismo","5.2","Emplazamiento","5.2.5","Equipamientos, Zonas verdes y Servicios Técnicos","SUELO","5.2.5.b",null,"Grado de adecuación de Zonas Verdes y de Equipamientos previstos por el planteamiento urbanístico","Grad 1-5",null,"Urbanismo",{"$f":"VLOOKUP(H217,CALCULOS!H:S,12,FALSE)","v":5}]

{"sheet":"CALCULOS_din","index":9,"n_rows":12,"n_cols":2,"rows_kept":12,"cut":false,"hidden":true,"merged":[]}
[]
[]
["Row Labels","Suma de Resultat_calculat"]
["Aspectos sociales y comunicación",0.61818181818181817]
["Gestión de los recursos",0.57499999999999996]
["Infrastructuras y servicios",0.51496062992125979]
["Integración ambiental y riesgos",0.41333333333333333]
["Urbanismo",0.72727272727272729]
["Grand Total",0.5342163355408388]
[]
[]
[null,{"$f":"IF('CALCULOS_din (5)'!E19<1,\"Incomplert\",(GETPIVOTDATA(\"Resultat_calculat\",$A$3)))","v":"Incomplert"}]

{"sheet":"CALCULOS_din (2)","index":10,"n_rows":31,"n_cols":2,"rows_kept":31,"cut":false,"hidden":true,"merged":[]}
[]
[]
["Row Labels","Suma de Resultat_calculat"]
["Aspectos sociales y comunicación",0.61818181818181817]
["Asociacionismo",0.8666666666666667]
["Colaboración",0.46153846153846156]
["Empleo y formación",0.66666666666666663]
["Promoción",0.54666666666666663]
["Gestión de los recursos",0.57499999999999996]
["agua",1]
["Energía y cambio climático",0.21666666666666667]
["Materia prima y producción",1]
["Residuos",0.7416666666666667]
["Simbiosis industrial",0.8]
["Infrastructuras y servicios",0.51496062992125979]
["Serveis avançats i/o compartits",1]
["Infrastructuras avanzadas",0.30769230769230771]
["Infrastructuras básicas",0.63140495867768598]
["Servicios avanzados y/o compartidos",0.41428571428571431]
["Servicios básicos",0.65714285714285714]
["Integración ambiental y riesgos",0.41333333333333333]
["Contaminación luminosa",1]
["Emisiones atmosféricas",0.5]
["Inundabilidad",0.5]
["Medio natural",0]
["Paisaje",0.78181818181818186]
["Ruido",0.2]
["Urbanismo",0.72727272727272729]
["Características de las parcelas",0.72]
["Emplazamiento",0.73333333333333328]
["Grand Total",0.5342163355408388]

{"sheet":"CALCULOS_din (3)","index":11,"n_rows":148,"n_cols":2,"rows_kept":148,"cut":false,"hidden":true,"merged":[]}
["NIVELL 1: GRUP","Aspectos sociales y comunicación"]
[]
["Row Labels","Suma de Resultat_calculat"]
["Asociacionismo y relación con empresarios",0.8666666666666667]
["Convenios y relación con otras entidades",0.45454545454545453]
["Convenios con otras entidades",0.5]
["Apoyo al empleo y emprendimiento",0.66666666666666663]
["Comunicación, promoción y señalización",0.54666666666666663]
["Grand Total",0.61818181818181817]
[]
[]
[]
[]
[]
[]
[]
[]
[]
[]
[]
[]
[]
[]
[]
[]
[]
[]
[]
[]
[]
[]
[]
["NIVELL 1: GRUP","Gestión de los recursos"]
[]
["Row Labels","Suma de Resultat_calculat"]
["agua",1]
["Energía y cambio climático",0.21666666666666667]
["Materia prima y producción",1]
["Residuos",0.7416666666666667]
["Simbiosis industrial",0.8]
["Grand Total",0.57499999999999996]
[]
[]
[]
[]
[]
[]
[]
[]
[]
[]
[]
[]
[]
[]
[]
[]
[]
[]
[]
[]
[]
[]
[]
[]
[]
[]
["NIVELL 1: GRUP","Infrastructuras y servicios"]
[]
["Row Labels","Suma de Resultat_calculat"]
["Serveis avançats i/o compartits",1]
["Infrastructuras avanzadas",0.30769230769230771]
["Infrastructuras básicas",0.63140495867768598]
["Servicios avanzados y/o compartidos",0.41428571428571431]
["Servicios básicos",0.65714285714285714]
["Grand Total",0.51496062992125979]
[]
[]
[]
[]
[]
[]
[]
[]
[]
[]
[]
[]
[]
[]
[]
[]
[]
[]
[]
[]
[]
[]
[]
[]
[]
[]
["NIVELL 1: GRUP","Integración ambiental y riesgos"]
[]
["Row Labels","Suma de Resultat_calculat"]
["Alumbrado adaptado",1]
["Control de emisiones atmosféricas",0]
["Calidad del aire",1]
["Afectación por zonas inundables",0.5]
["Integración en el entorno natural",0]
["Grado de calidad del paisaje e integración del PAE",0.78181818181818186]
["Protección contra el ruido",0.2]
["Grand Total",0.41333333333333333]
[]
[]
[]
[]
[]
[]
[]
[]
[]
[]
[]
[]
[]
[]
[]
[]
[]
[]
[]
[]
[]
["NIVELL 1: GRUP","Urbanismo"]
[]
["Row Labels","Suma de Resultat_calculat"]
["Grado de ocupación de los PAE",0.8]
["Titularidad de las parcelas vacantes y grado de comercialización",1]
["Tipología de las parcelas",0.8]
["Capacidad de expansión de implantaciones actuales",0.4]
["Tipología de las edificaciones",0.6]
["Acceso desde Áreas Residenciales",0.8]
["Acceso desde Áreas Industriales",0.6]
["Estado favorable de la tramitación urbanística",1]
["Capacidad de ampliación",0]
["Equipamientos, Zonas verdes y Servicios Técnicos",1]
["Grand Total",0.72727272727272729]

{"sheet":"CALCULOS_din (4)","index":12,"n_rows":15,"n_cols":2,"rows_kept":15,"cut":false,"hidden":true,"merged":[]}
[]
[]
["Row Labels","Suma de Resultat_calculat"]
["SOCIAL",0.61212121212121207]
["COLABORACIÓN",0.69729729729729728]
["AGUA",0.77647058823529413]
["ENERGÍA Y CAMBIO CLIMATIC",0.28192771084337348]
["MATERIALES",1]
["RESIDUOS",0.61025641025641031]
["MOVILIDAD",0.39555555555555555]
["CALIDAD DEL ESPACIO",0.40909090909090912]
["SEGURIDAD",0.42926829268292682]
["TELECOMUNICACIONES",0.66666666666666663]
["SUELO",0.73333333333333328]
["Grand Total",0.5342163355408388]

{"sheet":"CALCULOS_din (5)","index":13,"n_rows":19,"n_cols":9,"rows_kept":19,"cut":false,"hidden":true,"merged":[]}
["CÀLCULS INCOMPLERT"]
[]
["Cuenta de Respostes","Column Labels"]
["Row Labels",0,1,2,3,4,5,"No","Sí"]
["Aspectos sociales y comunicación",9.6774193548387094E-2,3.2258064516129031E-2,0,0,3.2258064516129031E-2,0,0.22580645161290322,0.61290322580645162]
["Gestión de los recursos",0,9.375E-2,3.125E-2,0,0,9.375E-2,0.3125,0.46875]
["Infrastructuras y servicios",8.0645161290322578E-3,0,0.19354838709677419,0,1.6129032258064516E-2,0,0.33064516129032256,0.45161290322580644]
["Integración ambiental y riesgos",0,5.5555555555555552E-2,0,0.1111111111111111,5.5555555555555552E-2,5.5555555555555552E-2,0.44444444444444442,0.27777777777777779]
["Urbanismo",0,0,9.0909090909090912E-2,0.18181818181818182,0.27272727272727271,0.27272727272727271,9.0909090909090912E-2,9.0909090909090912E-2]
[]
[]
[]
["Etiquetas de fila",null,"no_data","Total","% Compleció"]
["Aspectos sociales y comunicación","no_data",{"$f":"COUNTIFS(CALCULOS!L:L,B14,CALCULOS!B:B,A14)","v":31},31,{"$f":"1-(C14/D14)","v":0}]
["Gestión de los recursos","no_data",{"$f":"COUNTIFS(CALCULOS!L:L,B15,CALCULOS!B:B,A15)","v":32},32,0]
["Infrastructuras y servicios","no_data",{"$f":"COUNTIFS(CALCULOS!L:L,B16,CALCULOS!B:B,A16)","v":123},124,8.0645161290322509E-3]
["Integración ambiental y riesgos","no_data",{"$f":"COUNTIFS(CALCULOS!L:L,B17,CALCULOS!B:B,A17)","v":18},18,0]
["Urbanismo","no_data",{"$f":"COUNTIFS(CALCULOS!L:L,B18,CALCULOS!B:B,A18)","v":11},11,0]
["Total",null,{"$f":"SUM(C14:C18)","v":215},{"$f":"SUM(D14:D18)","v":216},{"$f":"1-(C19/D19)","v":4.6296296296296502E-3}]

{"sheet":"CALCULOS_din Millores","index":14,"n_rows":65,"n_cols":13,"rows_kept":65,"cut":false,"hidden":true,"merged":[[6,8,6,11],[7,8,7,11],[2,8,2,11],[3,8,3,11],[4,8,4,11]]}
["PRESENTACIÓ DE MILLORES PRIORITÀRIES EN ASPECTES D'ECOEFICIÈNCIA"]
[]
["Valor màxim",15,null,null,null,null,null,null,"VALOR MÀXIM ",null,null,null,{"$f":"CALCULOS!S218","v":2265}]
["Respostes","(Multiple Items)",null,null,null,null,null,null,"VALOR GLOBAL ACTUAL",null,null,null,{"$f":"CALCULOS!R218","v":0}]
["Càlcul","(Multiple Items)",null,null,null,null,null,null,"SUMA AMB MILLORES",null,null,null,{"$f":"SUM(D8:D349)-SUM(C8:C349)","v":756}]
[]
["Row Labels","Suma de Resultat_calculat","Suma de Valor ponderat","Suma de Valor màxim",null,null,null,null,"Realizando las mejoras aumentaríamos la ecoeficiencia en un ",null,null,null,{"$f":"IFERROR(M5/M4,\"-\")","v":"-"}]
["Aspectos sociales y comunicación",null,null,null,null,null,null,null,"Se podría conseguir un valor de",null,null,null,{"$f":"(M4+M5)/M3","v":0.33377483443708611}]
["Crear un procedimiento para recoger y analizar datos de necesidades o demandas de las empresas y entidades del PAE",0,0,15]
["Crear o contratar una plataforma de teleformación similar para ofrecer cursos, seminarios, etc. A trabajadores y empresarios",0,0,15]
["Registrar las apariciones de la asociación o equivalente y de sus empresas en los medios de comunicación",0,0,15]
["Promover y/o participar en jornadas o proyectos con objetivos sociales y/o ambientales",0,0,15]
["Gestión de los recursos"]
["Obtener datos de consumo eléctrico a las empresas con el máximo nivel de detalle y actualización, avanzando hacia la figura del gestor energético.",0.2,3,15]
["Obtener datos de consumo térmico las empresas con el máximo nivel de detalle y actualización, avanzando hacia la figura del gestor energético.",0.2,3,15]
["Disponer de los datos de producción de energías renovables en el PAE",0,0,15]
["Disponer de infraestructuras de producción de energía renovable.",0,0,15]
["Fomentar y/o participar en una comunidad energética local que incorpore a empresas del PAE",0.2,3,15]
["Elaborar un estudio del potencial de producción de energía solar fotovoltaica/térmica en el PAE",0,0,15]
["Disponer de información sobre el potencial de producción eólica y/o registros o estacion de medida viento.",0,0,15]
["Realizar estudios o iniciar un servicio para el fomento de la eficiencia energética en las empresas.",0,0,15]
["Ofrecer a las empresas un sistema de compensación de emisiones, preferiblemente con proyectos locales",0,0,15]
["Compensar sus emisiones relativas a las actividades de gestión del PAE",0,0,15]
["Solicitar al ARC (Generalitat de Catalunya) y obtener los datos de generación de residuos de las empresas del PAE",0,0,15]
["Disponer de los datos de residuos que realmente se recuperen.",0,0,15]
["Infrastructuras y servicios"]
["Crear una central de producción de energía renovable, de gestión pública o participada por la asociación",0,0,15]
["Fomentar y/o participar en infraestructuras de gestión energética como baterías industriales, smart grids, etc.",0,0,15]
["Fomentar y/o participar en la creación de redes de producción de calor",0,0,15]
["Fomentar y/o participar en la creación de redes de producción de frío",0,0,15]
["Disponer o realizar reservas de espacio de zanjas por redes, si no se dispone de ellas",0,0,15]
["Realizar un estudio del potencial de redes de calor/frío en el ámbito del PAE",0,0,15]
["Instalar y/o fomentar la instalación de puntos de recarga por vehículos eléctricos",0.4,6,15]
["Instalar y/o fomentar la instalación de una fotolinera (zona de recarga rápida de vehículos eléctricos)",0,0,15]
["Nuevos carreras y carreteras y reparaciones con materiales con etiqueta y certificaciones de sostenibilidad",0,0,15]
["Definir políticas de aparcamiento de vehículos que fomenten la movilidad sostenible dentro del PAE y para acceder a ellas desde las zonas más urbanas",0,0,15]
["Adecuar recorridos seguros y agradables para fomentar el acceso a pie, bicicleta o similar",0.4,6,15]
["Fomentar la cobertura móvil de alta velocidad, preferiblemente 5G, en todo el PAE",0.4,6,15]
["Ofrecer un servicio de gestión energética y/o ambiental",0,0,15]
["Poner en marcha o impulsar un servicio de vehículos compartidos (Carsharing, bicicletas compartidas, motocicletas eléctricas, patinetes…)",0,0,15]
["Ofrecer un servicio agregado o mancomunado de mensajería",0,0,15]
["Impulsar y/o fomentar servicios logísticos compartidos o integrados",0,0,15]
["Registrar las actuaciones de mantenimiento de parcelas relacionadas con la limpieza, malas hierbas, limpieza de vertidos incontrolados de residuos, etc",0,0,15]
["Velar por un correcto mantenimiento de las parcelas vacías por una mejora de la imagen, seguridad, evitar plagas, etc.",0.4,6,15]
["Crear acuerdos con los titulares de parcelas para su mantenimiento",0,0,15]
["Velar por que las parcelas vacías estén cerradas al público",0,0,15]
["Promoción de espacios y servicios de bienestar por las personas (pensado por trabajadores y familiares), como espacios de ocio, gimnasio, fisioterapia, etc.",0,0,15]
["Crear, impulsar o inscribirse en un servicio de bolsa de subproductos y recursos industriales",0,0,15]
["Crear, impulsar o inscribirse a un servicio de Punto verde industrial",0,0,15]
["Elaborar y mantener un Plan de Emergencias del PAE y realizar las correspondientes comunicaciones a las empresas",0.2,6,30]
["Realizar la correspondiente formación y coordinación con los responsables de la vigilancia privada (en su caso), protección civil, policía local, etc. En relación a posibles emergencias en el PAE",0.4,6,15]
["Definir claramente las responsabilidades ante una emergencia en el PAE (normalmente, definidas en el Plan de Emergencia)",0,0,15]
["Disponer de elementos técnicos para la vigilancia del PAE en buen estado de funcionamiento y mantenimiento (p.ej. pilones por control de tráfico, videovigilancia, iluminación de seguridad, radio…)",0.4,6,15]
["Realizar simulacros de Emergencias y analizar sus resultados para mejorar el Plan de Emergencia",0,0,15]
["Disponer de un centro, servicio o responsable que centralice la gestión de emergencias en el PAE",0,0,15]
["Integración ambiental y riesgos"]
["Disponer de una estación de medida de inmisión de contaminantes atmosféricos (CO, PM10, Nox, SO2, etc)",0,0,15]
["Evaluar y la necesidad y, en su caso, crear pasos de fauna para garantizar la conectividad ecológica",0,0,15]
["Mantenimiento de los perimetros de protección/franjas por control riesgo incendio forestal",0,0,15]
["En el caso de PAE no delimitados por trama urbana, disponer de información y/o estudios sobre posibles afectaciones a la fauna por la circulación de vehículos, emnisiones atmosféricas, ruidos o contaminación luminosa",0,0,15]
["En caso de ser consideradas necesarias en estudios previos, crear medidas de protección en fauna (aves nidificantes, protección de zonas especiales, control de ruido, control iluminación, etc.)",0,0,15]
["Realizar acciones para fomentar la integración paisajística de las construcciones y la morfología general del PAE en el paisaje",0.6,9,15]
["Realizar acciones para fomentar que las personas dentro del entorno del PAE tengan una buena percepción del paisaje (acciones como ajardinamiento, eliminación de zonas banales, permitir visuales en el paisaje del entorno, miradores, etc)",0.6,9,15]
["Nuevos carreras y carreteras y reparaciones con materiales sonoreductores o medidas similares",0,0,15]
["Realizar acciones de medida del ruido (inmisión) y/o crear o poder acceder a un servicio para su control de acuerdo a la legislación.",0,0,15]

{"sheet":"CALCULOS","index":15,"n_rows":218,"n_cols":21,"rows_kept":218,"cut":false,"hidden":true,"merged":[]}
["CODI_NIV1","NIVELL 1: GRUP","CODI_NIV2","NIVELL 2: LÍNIA","CODI_NIV3","NIVELL 3: ÍTEM","VECTOR DE SOSTENIBILITAT","CODI_NIV4_IND","AVANÇAT?","NIVELL 4: PARÀMETRE/INDICADOR","Tipus_resp","Respostes","Càlcul","Valor SI","Valor NO","Valor Nul","Ponderació","Valor ponderat","Valor màxim","Result_criteri",{"$f":"ListaCriterios!O1","v":"Proposta de millora"}]
[{"$f":"ListaCriterios!A2","v":1},{"$f":"ListaCriterios!B2","v":"Aspectos sociales y comunicación"},{"$f":"ListaCriterios!C2","v":"1.1"},{"$f":"ListaCriterios!D2","v":"Asociacionismo"},{"$f":"ListaCriterios!E2","v":"1.1.1"},{"$f":"ListaCriterios!F2","v":"Asociacionismo y relación con empresarios"},{"$f":"ListaCriterios!G2","v":"COLABORACIÓN"},{"$f":"ListaCriterios!H2","v":"1.1.1.a"},{"$f":"ListaCriterios!I2","v":0},{"$f":"ListaCriterios!J2","v":"¿Existe asociación de empresarios?"},{"$f":"ListaCriterios!K2","v":"SI/NO"},{"$f":"IF(VLOOKUP(J2,'1.ASP SOCIALES Y COM'!I:K,3,FALSE)=\"\",\"no_data\",VLOOKUP(J2,'1.ASP SOCIALES Y COM'!I:K,3,FALSE))","v":"no_data"},{"$f":"IF(L2=\"no_data\",0,(IF(K2=\"SI/NO\",IF(L2=\"Sí\",N2,IF(L2=\"No\",O2,P2)),L2)))","v":0},5,0,0,1,{"$f":"M2*Q2","v":0},{"$f":"Q2*5","v":5},{"$f":"M2/S2","v":0},{"$f":"ListaCriterios!O2","v":0}]
[{"$f":"ListaCriterios!A3","v":1},{"$f":"ListaCriterios!B3","v":"Aspectos sociales y comunicación"},{"$f":"ListaCriterios!C3","v":"1.1"},{"$f":"ListaCriterios!D3","v":"Asociacionismo"},{"$f":"ListaCriterios!E3","v":"1.1.1"},{"$f":"ListaCriterios!F3","v":"Asociacionismo y relación con empresarios"},{"$f":"ListaCriterios!G3","v":"COLABORACIÓN"},{"$f":"ListaCriterios!H3","v":"1.1.1.b"},{"$f":"ListaCriterios!I3","v":0},{"$f":"ListaCriterios!J3","v":"¿Más del 50% de las empresas están asociadas?"},{"$f":"ListaCriterios!K3","v":"SI/NO"},{"$f":"IF(VLOOKUP(J3,'1.ASP SOCIALES Y COM'!I:K,3,FALSE)=\"\",\"no_data\",VLOOKUP(J3,'1.ASP SOCIALES Y COM'!I:K,3,FALSE))","v":"no_data"},0,5,0,0,1,{"$f":"M3*Q3","v":0},{"$f":"Q3*5","v":5},{"$f":"M3/S3","v":0},{"$f":"ListaCriterios!O3","v":0}]
[{"$f":"ListaCriterios!A4","v":1},{"$f":"ListaCriterios!B4","v":"Aspectos sociales y comunicación"},{"$f":"ListaCriterios!C4","v":"1.1"},{"$f":"ListaCriterios!D4","v":"Asociacionismo"},{"$f":"ListaCriterios!E4","v":"1.1.1"},{"$f":"ListaCriterios!F4","v":"Asociacionismo y relación con empresarios"},{"$f":"ListaCriterios!G4","v":"COLABORACIÓN"},{"$f":"ListaCriterios!H4","v":"1.1.1.c"},{"$f":"ListaCriterios!I4","v":"X"},{"$f":"ListaCriterios!J4","v":"¿La asociación dispone de estructura profesionalizada?"},{"$f":"ListaCriterios!K4","v":"SI/NO"},{"$f":"IF(VLOOKUP(J4,'1.ASP SOCIALES Y COM'!I:K,3,FALSE)=\"\",\"no_data\",VLOOKUP(J4,'1.ASP SOCIALES Y COM'!I:K,3,FALSE))","v":"no_data"},0,5,0,0,3,0,15,0,{"$f":"ListaCriterios!O4","v":"Crear una estructura profesional por la asociación o entidad de gestión del PAE"}]
[{"$f":"ListaCriterios!A5","v":1},{"$f":"ListaCriterios!B5","v":"Aspectos sociales y comunicación"},{"$f":"ListaCriterios!C5","v":"1.1"},{"$f":"ListaCriterios!D5","v":"Asociacionismo"},{"$f":"ListaCriterios!E5","v":"1.1.1"},{"$f":"ListaCriterios!F5","v":"Asociacionismo y relación con empresarios"},{"$f":"ListaCriterios!G5","v":"COLABORACIÓN"},{"$f":"ListaCriterios!H5","v":"1.1.1.d"},{"$f":"ListaCriterios!I5","v":0},{"$f":"ListaCriterios!J5","v":"¿Está inscrita la asociación como APEU?"},{"$f":"ListaCriterios!K5","v":"SI/NO"},{"$f":"IF(VLOOKUP(J5,'1.ASP SOCIALES Y COM'!I:K,3,FALSE)=\"\",\"no_data\",VLOOKUP(J5,'1.ASP SOCIALES Y COM'!I:K,3,FALSE))","v":"no_data"},0,5,0,0,1,0,5,0,{"$f":"ListaCriterios!O5","v":0}]
[{"$f":"ListaCriterios!A6","v":1},{"$f":"ListaCriterios!B6","v":"Aspectos sociales y comunicación"},{"$f":"ListaCriterios!C6","v":"1.1"},{"$f":"ListaCriterios!D6","v":"Asociacionismo"},{"$f":"ListaCriterios!E6","v":"1.1.1"},{"$f":"ListaCriterios!F6","v":"Asociacionismo y relación con empresarios"},{"$f":"ListaCriterios!G6","v":"COLABORACIÓN"},{"$f":"ListaCriterios!H6","v":"1.1.1.e"},{"$f":"ListaCriterios!I6","v":0},{"$f":"ListaCriterios!J6","v":"Actividades divulgativas realizadas por la entidad de gestión en su territorio en los últimos 2 años"},{"$f":"ListaCriterios!K6","v":"Grad 0-5"},{"$f":"IF(VLOOKUP(J6,'1.ASP SOCIALES Y COM'!I:K,3,FALSE)=\"\",\"no_data\",VLOOKUP(J6,'1.ASP SOCIALES Y COM'!I:K,3,FALSE))","v":"no_data"},0,5,0,0,1,0,5,0,{"$f":"ListaCriterios!O6","v":0}]
[{"$f":"ListaCriterios!A7","v":1},{"$f":"ListaCriterios!B7","v":"Aspectos sociales y comunicación"},{"$f":"ListaCriterios!C7","v":"1.1"},{"$f":"ListaCriterios!D7","v":"Asociacionismo"},{"$f":"ListaCriterios!E7","v":"1.1.1"},{"$f":"ListaCriterios!F7","v":"Asociacionismo y relación con empresarios"},{"$f":"ListaCriterios!G7","v":"COLABORACIÓN"},{"$f":"ListaCriterios!H7","v":"1.1.1.f"},{"$f":"ListaCriterios!I7","v":0},{"$f":"ListaCriterios!J7","v":"Evidencias de proyectos realizados con partes interesadas de su territorio en los últimos 2 años"},{"$f":"ListaCriterios!K7","v":"Grad 0-5"},{"$f":"IF(VLOOKUP(J7,'1.ASP SOCIALES Y COM'!I:K,3,FALSE)=\"\",\"no_data\",VLOOKUP(J7,'1.ASP SOCIALES Y COM'!I:K,3,FALSE))","v":"no_data"},0,5,0,0,1,0,5,0,{"$f":"ListaCriterios!O7","v":0}]
[{"$f":"ListaCriterios!A8","v":1},{"$f":"ListaCriterios!B8","v":"Aspectos sociales y comunicación"},{"$f":"ListaCriterios!C8","v":"1.1"},{"$f":"ListaCriterios!D8","v":"Asociacionismo"},{"$f":"ListaCriterios!E8","v":"1.1.1"},{"$f":"ListaCriterios!F8","v":"Asociacionismo y relación con empresarios"},{"$f":"ListaCriterios!G8","v":"COLABORACIÓN"},{"$f":"ListaCriterios!H8","v":"1.1.1.g"},{"$f":"ListaCriterios!I8","v":0},{"$f":"ListaCriterios!J8","v":"¿Se han realizado acciones, reuniones o actividades con partes interesadas de su territorio?"},{"$f":"ListaCriterios!K8","v":"SI/NO"},{"$f":"IF(VLOOKUP(J8,'1.ASP SOCIALES Y COM'!I:K,3,FALSE)=\"\",\"no_data\",VLOOKUP(J8,'1.ASP SOCIALES Y COM'!I:K,3,FALSE))","v":"no_data"},0,5,0,0,1,0,5,0,{"$f":"ListaCriterios!O8","v":0}]
[{"$f":"ListaCriterios!A9","v":1},{"$f":"ListaCriterios!B9","v":"Aspectos sociales y comunicación"},{"$f":"ListaCriterios!C9","v":"1.2"},{"$f":"ListaCriterios!D9","v":"Colaboración"},{"$f":"ListaCriterios!E9","v":"1.2.1"},{"$f":"ListaCriterios!F9","v":"Convenios y relación con otras entidades"},{"$f":"ListaCriterios!G9","v":"COLABORACIÓN"},{"$f":"ListaCriterios!H9","v":"1.2.1.a"},{"$f":"ListaCriterios!I9","v":0},{"$f":"ListaCriterios!J9","v":"Reuniones o contactos informativos realizados con partes interesadas de su territorio en los últimos 2 años"},{"$f":"ListaCriterios!K9","v":"Grad 0-5"},{"$f":"IF(VLOOKUP(J9,'1.ASP SOCIALES Y COM'!I:K,3,FALSE)=\"\",\"no_data\",VLOOKUP(J9,'1.ASP SOCIALES Y COM'!I:K,3,FALSE))","v":"no_data"},0,5,0,0,1,0,5,0,{"$f":"ListaCriterios!O9","v":0}]
[{"$f":"ListaCriterios!A10","v":1},{"$f":"ListaCriterios!B10","v":"Aspectos sociales y comunicación"},{"$f":"ListaCriterios!C10","v":"1.2"},{"$f":"ListaCriterios!D10","v":"Colaboración"},{"$f":"ListaCriterios!E10","v":"1.2.1"},{"$f":"ListaCriterios!F10","v":"Convenios y relación con otras entidades"},{"$f":"ListaCriterios!G10","v":"COLABORACIÓN"},{"$f":"ListaCriterios!H10","v":"1.2.1.b"},{"$f":"ListaCriterios!I10","v":"X"},{"$f":"ListaCriterios!J10","v":"¿Se han realizado acciones, reuniones o actividades con administraciones públicas de su territorio?"},{"$f":"ListaCriterios!K10","v":"SI/NO"},{"$f":"IF(VLOOKUP(J10,'1.ASP SOCIALES Y COM'!I:K,3,FALSE)=\"\",\"no_data\",VLOOKUP(J10,'1.ASP SOCIALES Y COM'!I:K,3,FALSE))","v":"no_data"},0,5,0,0,3,0,15,0,{"$f":"ListaCriterios!O10","v":"Iniciar contactos, actividades y reuniones con las administraciones públicas del territorio"}]
[{"$f":"ListaCriterios!A11","v":1},{"$f":"ListaCriterios!B11","v":"Aspectos sociales y comunicación"},{"$f":"ListaCriterios!C11","v":"1.2"},{"$f":"ListaCriterios!D11","v":"Colaboración"},{"$f":"ListaCriterios!E11","v":"1.2.1"},{"$f":"ListaCriterios!F11","v":"Convenios y relación con otras entidades"},{"$f":"ListaCriterios!G11","v":"COLABORACIÓN"},{"$f":"ListaCriterios!H11","v":"1.2.1.c"},{"$f":"ListaCriterios!I11","v":0},{"$f":"ListaCriterios!J11","v":"¿Se han realizado acciones, reuniones o actividades con empresas del área/titulares de parcelas?"},{"$f":"ListaCriterios!K11","v":"SI/NO"},{"$f":"IF(VLOOKUP(J11,'1.ASP SOCIALES Y COM'!I:K,3,FALSE)=\"\",\"no_data\",VLOOKUP(J11,'1.ASP SOCIALES Y COM'!I:K,3,FALSE))","v":"no_data"},0,5,0,0,1,0,5,0,{"$f":"ListaCriterios!O11","v":0}]
[{"$f":"ListaCriterios!A12","v":1},{"$f":"ListaCriterios!B12","v":"Aspectos sociales y comunicación"},{"$f":"ListaCriterios!C12","v":"1.2"},{"$f":"ListaCriterios!D12","v":"Colaboración"},{"$f":"ListaCriterios!E12","v":"1.2.1"},{"$f":"ListaCriterios!F12","v":"Convenios y relación con otras entidades"},{"$f":"ListaCriterios!G12","v":"COLABORACIÓN"},{"$f":"ListaCriterios!H12","v":"1.2.1.d"},{"$f":"ListaCriterios!I12","v":0},{"$f":"ListaCriterios!J12","v":"¿Se han realizado acciones, reuniones o actividades con entidades de formación de su territorio?"},{"$f":"ListaCriterios!K12","v":"SI/NO"},{"$f":"IF(VLOOKUP(J12,'1.ASP SOCIALES Y COM'!I:K,3,FALSE)=\"\",\"no_data\",VLOOKUP(J12,'1.ASP SOCIALES Y COM'!I:K,3,FALSE))","v":"no_data"},0,5,0,0,1,0,5,0,{"$f":"ListaCriterios!O12","v":0}]
[{"$f":"ListaCriterios!A13","v":1},{"$f":"ListaCriterios!B13","v":"Aspectos sociales y comunicación"},{"$f":"ListaCriterios!C13","v":"1.2"},{"$f":"ListaCriterios!D13","v":"Colaboración"},{"$f":"ListaCriterios!E13","v":"1.2.1"},{"$f":"ListaCriterios!F13","v":"Convenios y relación con otras entidades"},{"$f":"ListaCriterios!G13","v":"COLABORACIÓN"},{"$f":"ListaCriterios!H13","v":"1.2.1.e"},{"$f":"ListaCriterios!I13","v":0},{"$f":"ListaCriterios!J13","v":"¿Se han realizado acciones, reuniones o actividades con entidades sociales (asociaciones, sindicatos, vecinales, etc?)."},{"$f":"ListaCriterios!K13","v":"SI/NO"},{"$f":"IF(VLOOKUP(J13,'1.ASP SOCIALES Y COM'!I:K,3,FALSE)=\"\",\"no_data\",VLOOKUP(J13,'1.ASP SOCIALES Y COM'!I:K,3,FALSE))","v":"no_data"},0,5,0,0,1,0,5,0,{"$f":"ListaCriterios!O13","v":0}]
[{"$f":"ListaCriterios!A14","v":1},{"$f":"ListaCriterios!B14","v":"Aspectos sociales y comunicación"},{"$f":"ListaCriterios!C14","v":"1.2"},{"$f":"ListaCriterios!D14","v":"Colaboración"},{"$f":"ListaCriterios!E14","v":"1.2.1"},{"$f":"ListaCriterios!F14","v":"Convenios y relación con otras entidades"},{"$f":"ListaCriterios!G14","v":"COLABORACIÓN"},{"$f":"ListaCriterios!H14","v":"1.2.1.f"},{"$f":"ListaCriterios!I14","v":"X"},{"$f":"ListaCriterios!J14","v":"Se tiene conocimiento sobre necesidades o demandas de las partes interesadas con su correspondiente tratamiento y análisis"},{"$f":"ListaCriterios!K14","v":"SI/NO"},{"$f":"IF(VLOOKUP(J14,'1.ASP SOCIALES Y COM'!I:K,3,FALSE)=\"\",\"no_data\",VLOOKUP(J14,'1.ASP SOCIALES Y COM'!I:K,3,FALSE))","v":"no_data"},0,5,0,0,3,0,15,0,{"$f":"ListaCriterios!O14","v":"Crear un procedimiento para recoger y analizar datos de necesidades o demandas de las empresas y entidades del PAE"}]
[{"$f":"ListaCriterios!A15","v":1},{"$f":"ListaCriterios!B15","v":"Aspectos sociales y comunicación"},{"$f":"ListaCriterios!C15","v":"1.2"},{"$f":"ListaCriterios!D15","v":"Colaboración"},{"$f":"ListaCriterios!E15","v":"1.2.1"},{"$f":"ListaCriterios!F15","v":"Convenios y relación con otras entidades"},{"$f":"ListaCriterios!G15","v":"COLABORACIÓN"},{"$f":"ListaCriterios!H15","v":"1.2.1.g"},{"$f":"ListaCriterios!I15","v":0},{"$f":"ListaCriterios!J15","v":"¿Se han realizado actividades de sensibilización, información o mejora de la conservación de las parcelas de polígono en los últimos 2 años?"},{"$f":"ListaCriterios!K15","v":"SI/NO"},{"$f":"IF(VLOOKUP(J15,'1.ASP SOCIALES Y COM'!I:K,3,FALSE)=\"\",\"no_data\",VLOOKUP(J15,'1.ASP SOCIALES Y COM'!I:K,3,FALSE))","v":"no_data"},0,5,0,0,1,0,5,0,{"$f":"ListaCriterios!O15","v":0}]
[{"$f":"ListaCriterios!A16","v":1},{"$f":"ListaCriterios!B16","v":"Aspectos sociales y comunicación"},{"$f":"ListaCriterios!C16","v":"1.2"},{"$f":"ListaCriterios!D16","v":"Colaboración"},{"$f":"ListaCriterios!E16","v":"1.2.2"},{"$f":"ListaCriterios!F16","v":"Convenios con otras entidades"},{"$f":"ListaCriterios!G16","v":"COLABORACIÓN"},{"$f":"ListaCriterios!H16","v":"1.2.2.a"},{"$f":"ListaCriterios!I16","v":0},{"$f":"ListaCriterios!J16","v":"¿Se dispone de acuerdos o convenios de colaboración/adhesión con otras entidades de gestión de áreas empresariales para el desarrollo de acciones de interés para el polígono o para el desarrollo de sinergias?"},{"$f":"ListaCriterios!K16","v":"SI/NO"},{"$f":"IF(VLOOKUP(J16,'1.ASP SOCIALES Y COM'!I:K,3,FALSE)=\"\",\"no_data\",VLOOKUP(J16,'1.ASP SOCIALES Y COM'!I:K,3,FALSE))","v":"no_data"},0,5,0,0,1,0,5,0,{"$f":"ListaCriterios!O16","v":0}]
[{"$f":"ListaCriterios!A17","v":1},{"$f":"ListaCriterios!B17","v":"Aspectos sociales y comunicación"},{"$f":"ListaCriterios!C17","v":"1.2"},{"$f":"ListaCriterios!D17","v":"Colaboración"},{"$f":"ListaCriterios!E17","v":"1.2.2"},{"$f":"ListaCriterios!F17","v":"Convenios con otras entidades"},{"$f":"ListaCriterios!G17","v":"COLABORACIÓN"},{"$f":"ListaCriterios!H17","v":"1.2.2.b"},{"$f":"ListaCriterios!I17","v":0},{"$f":"ListaCriterios!J17","v":"Ha participado la entidad de gestión en eventos, jornadas o grupos de trabajo en materia de dinamización de áreas empresariales"},{"$f":"ListaCriterios!K17","v":"SI/NO"},{"$f":"IF(VLOOKUP(J17,'1.ASP SOCIALES Y COM'!I:K,3,FALSE)=\"\",\"no_data\",VLOOKUP(J17,'1.ASP SOCIALES Y COM'!I:K,3,FALSE))","v":"no_data"},0,5,0,0,1,0,5,0,{"$f":"ListaCriterios!O17","v":0}]
[{"$f":"ListaCriterios!A18","v":1},{"$f":"ListaCriterios!B18","v":"Aspectos sociales y comunicación"},{"$f":"ListaCriterios!C18","v":"1.3"},{"$f":"ListaCriterios!D18","v":"Empleo y formación"},{"$f":"ListaCriterios!E18","v":"1.3.1"},{"$f":"ListaCriterios!F18","v":"Apoyo al empleo y emprendimiento"},{"$f":"ListaCriterios!G18","v":"SOCIAL"},{"$f":"ListaCriterios!H18","v":"1.3.1.a"},{"$f":"ListaCriterios!I18","v":"X"},{"$f":"ListaCriterios!J18","v":"¿Se ha interaccionado con entidades educativas para acercar el polígono a esta actividad?"},{"$f":"ListaCriterios!K18","v":"SI/NO"},{"$f":"IF(VLOOKUP(J18,'1.ASP SOCIALES Y COM'!I:K,3,FALSE)=\"\",\"no_data\",VLOOKUP(J18,'1.ASP SOCIALES Y COM'!I:K,3,FALSE))","v":"no_data"},0,5,0,0,3,0,15,0,{"$f":"ListaCriterios!O18","v":"Realizar contactos con entidades educativas para crear propuestas y actividades que permitan mejorar las competencias de los trabajadores y acercar la actividad a los estudiantes"}]
[{"$f":"ListaCriterios!A19","v":1},{"$f":"ListaCriterios!B19","v":"Aspectos sociales y comunicación"},{"$f":"ListaCriterios!C19","v":"1.3"},{"$f":"ListaCriterios!D19","v":"Empleo y formación"},{"$f":"ListaCriterios!E19","v":"1.3.1"},{"$f":"ListaCriterios!F19","v":"Apoyo al empleo y emprendimiento"},{"$f":"ListaCriterios!G19","v":"SOCIAL"},{"$f":"ListaCriterios!H19","v":"1.3.1.b"},{"$f":"ListaCriterios!I19","v":0},{"$f":"ListaCriterios!J19","v":"¿Ha habido algún tipo de interrelación, sensibilización o dinamización del ámbito de la educación reglada en el polígono empresarial?"},{"$f":"ListaCriterios!K19","v":"SI/NO"},{"$f":"IF(VLOOKUP(J19,'1.ASP SOCIALES Y COM'!I:K,3,FALSE)=\"\",\"no_data\",VLOOKUP(J19,'1.ASP SOCIALES Y COM'!I:K,3,FALSE))","v":"no_data"},0,5,0,0,1,0,5,0,{"$f":"ListaCriterios!O19","v":0}]
[{"$f":"ListaCriterios!A20","v":1},{"$f":"ListaCriterios!B20","v":"Aspectos sociales y comunicación"},{"$f":"ListaCriterios!C20","v":"1.3"},{"$f":"ListaCriterios!D20","v":"Empleo y formación"},{"$f":"ListaCriterios!E20","v":"1.3.1"},{"$f":"ListaCriterios!F20","v":"Apoyo al empleo y emprendimiento"},{"$f":"ListaCriterios!G20","v":"SOCIAL"},{"$f":"ListaCriterios!H20","v":"1.3.1.c"},{"$f":"ListaCriterios!I20","v":0},{"$f":"ListaCriterios!J20","v":"¿Se dispone de bolsa de empleo o similar de acceso público online?"},{"$f":"ListaCriterios!K20","v":"SI/NO"},{"$f":"IF(VLOOKUP(J20,'1.ASP SOCIALES Y COM'!I:K,3,FALSE)=\"\",\"no_data\",VLOOKUP(J20,'1.ASP SOCIALES Y COM'!I:K,3,FALSE))","v":"no_data"},0,5,0,0,1,0,5,0,{"$f":"ListaCriterios!O20","v":0}]
[{"$f":"ListaCriterios!A21","v":1},{"$f":"ListaCriterios!B21","v":"Aspectos sociales y comunicación"},{"$f":"ListaCriterios!C21","v":"1.3"},{"$f":"ListaCriterios!D21","v":"Empleo y formación"},{"$f":"ListaCriterios!E21","v":"1.3.1"},{"$f":"ListaCriterios!F21","v":"Apoyo al empleo y emprendimiento"},{"$f":"ListaCriterios!G21","v":"SOCIAL"},{"$f":"ListaCriterios!H21","v":"1.3.1.d"},{"$f":"ListaCriterios!I21","v":"X"},{"$f":"ListaCriterios!J21","v":"Actividades de divulgación y promoción del empleo y el emprendimiento entre las empresas del polígono en los últimos 2 años"},{"$f":"ListaCriterios!K21","v":"Grad 1-5"},{"$f":"IF(VLOOKUP(J21,'1.ASP SOCIALES Y COM'!I:K,3,FALSE)=\"\",\"no_data\",VLOOKUP(J21,'1.ASP SOCIALES Y COM'!I:K,3,FALSE))","v":"no_data"},0,5,0,0,3,0,15,0,{"$f":"ListaCriterios!O21","v":"Realizar más actividades para promover el empleo y el emprendimiento en las empresas del PAE"}]
[{"$f":"ListaCriterios!A22","v":1},{"$f":"ListaCriterios!B22","v":"Aspectos sociales y comunicación"},{"$f":"ListaCriterios!C22","v":"1.3"},{"$f":"ListaCriterios!D22","v":"Empleo y formación"},{"$f":"ListaCriterios!E22","v":"1.3.1"},{"$f":"ListaCriterios!F22","v":"Apoyo al empleo y emprendimiento"},{"$f":"ListaCriterios!G22","v":"SOCIAL"},{"$f":"ListaCriterios!H22","v":"1.3.1.e"},{"$f":"ListaCriterios!I22","v":"X"},{"$f":"ListaCriterios!J22","v":"Disponibilidad o acceso a plataforma de teleformación"},{"$f":"ListaCriterios!K22","v":"SI/NO"},{"$f":"IF(VLOOKUP(J22,'1.ASP SOCIALES Y COM'!I:K,3,FALSE)=\"\",\"no_data\",VLOOKUP(J22,'1.ASP SOCIALES Y COM'!I:K,3,FALSE))","v":"no_data"},0,5,0,0,3,0,15,0,{"$f":"ListaCriterios!O22","v":"Crear o contratar una plataforma de teleformación similar para ofrecer cursos, seminarios, etc. A trabajadores y empresarios"}]
[{"$f":"ListaCriterios!A23","v":1},{"$f":"ListaCriterios!B23","v":"Aspectos sociales y comunicación"},{"$f":"ListaCriterios!C23","v":"1.3"},{"$f":"ListaCriterios!D23","v":"Empleo y formación"},{"$f":"ListaCriterios!E23","v":"1.3.1"},{"$f":"ListaCriterios!F23","v":"Apoyo al empleo y emprendimiento"},{"$f":"ListaCriterios!G23","v":"SOCIAL"},{"$f":"ListaCriterios!H23","v":"1.3.1.g"},{"$f":"ListaCriterios!I23","v":"X"},{"$f":"ListaCriterios!J23","v":"¿Se han realizado acciones en el ámbito de la formación para el empleo en el polígono empresarial, de acuerdo con las necesidades de las empresas?"},{"$f":"ListaCriterios!K23","v":"SI/NO"},{"$f":"IF(VLOOKUP(J23,'1.ASP SOCIALES Y COM'!I:K,3,FALSE)=\"\",\"no_data\",VLOOKUP(J23,'1.ASP SOCIALES Y COM'!I:K,3,FALSE))","v":"no_data"},0,5,0,0,3,0,15,0,{"$f":"ListaCriterios!O23","v":"Realizar acciones en el ámbito de la formación para el empleo en el polígono empresarial de acuerdo con las necesidades de las empresas"}]
[{"$f":"ListaCriterios!A24","v":1},{"$f":"ListaCriterios!B24","v":"Aspectos sociales y comunicación"},{"$f":"ListaCriterios!C24","v":"1.3"},{"$f":"ListaCriterios!D24","v":"Empleo y formación"},{"$f":"ListaCriterios!E24","v":"1.3.1"},{"$f":"ListaCriterios!F24","v":"Apoyo al empleo y emprendimiento"},{"$f":"ListaCriterios!G24","v":"SOCIAL"},{"$f":"ListaCriterios!H24","v":"1.3.1.h"},{"$f":"ListaCriterios!I24","v":"X"},{"$f":"ListaCriterios!J24","v":"¿Dispone la entidad de un programa de bolsa de empleo o similar para personas que buscan trabajo en el territorio?"},{"$f":"ListaCriterios!K24","v":"SI/NO"},{"$f":"IF(VLOOKUP(J24,'1.ASP SOCIALES Y COM'!I:K,3,FALSE)=\"\",\"no_data\",VLOOKUP(J24,'1.ASP SOCIALES Y COM'!I:K,3,FALSE))","v":"no_data"},0,5,0,0,3,0,15,0,{"$f":"ListaCriterios!O24","v":"Dispone de un programa de bolsa de empleo o similar para personas que buscan trabajo en el territorio"}]
[{"$f":"ListaCriterios!A25","v":1},{"$f":"ListaCriterios!B25","v":"Aspectos sociales y comunicación"},{"$f":"ListaCriterios!C25","v":"1.3"},{"$f":"ListaCriterios!D25","v":"Empleo y formación"},{"$f":"ListaCriterios!E25","v":"1.3.1"},{"$f":"ListaCriterios!F25","v":"Apoyo al empleo y emprendimiento"},{"$f":"ListaCriterios!G25","v":"SOCIAL"},{"$f":"ListaCriterios!H25","v":"1.3.1.i"},{"$f":"ListaCriterios!I25","v":0},{"$f":"ListaCriterios!J25","v":"¿Existe formación en el territorio cercano adecuado a las necesidades de las empresas del PAE?"},{"$f":"ListaCriterios!K25","v":"SI/NO"},{"$f":"IF(VLOOKUP(J25,'1.ASP SOCIALES Y COM'!I:K,3,FALSE)=\"\",\"no_data\",VLOOKUP(J25,'1.ASP SOCIALES Y COM'!I:K,3,FALSE))","v":"no_data"},0,5,0,0,1,0,5,0,{"$f":"ListaCriterios!O25","v":0}]
[{"$f":"ListaCriterios!A26","v":1},{"$f":"ListaCriterios!B26","v":"Aspectos sociales y comunicación"},{"$f":"ListaCriterios!C26","v":"1.4"},{"$f":"ListaCriterios!D26","v":"Promoción"},{"$f":"ListaCriterios!E26","v":"1.4.1"},{"$f":"ListaCriterios!F26","v":"Comunicación, promoción y señalización"},{"$f":"ListaCriterios!G26","v":"SOCIAL"},{"$f":"ListaCriterios!H26","v":"1.4.1.a"},{"$f":"ListaCriterios!I26","v":0},{"$f":"ListaCriterios!J26","v":"¿El área empresarial tiene una imagen corporativa (logo) del área empresarial?"},{"$f":"ListaCriterios!K26","v":"SI/NO"},{"$f":"IF(VLOOKUP(J26,'1.ASP SOCIALES Y COM'!I:K,3,FALSE)=\"\",\"no_data\",VLOOKUP(J26,'1.ASP SOCIALES Y COM'!I:K,3,FALSE))","v":"no_data"},0,5,0,0,1,0,5,0,{"$f":"ListaCriterios!O26","v":0}]
[{"$f":"ListaCriterios!A27","v":1},{"$f":"ListaCriterios!B27","v":"Aspectos sociales y comunicación"},{"$f":"ListaCriterios!C27","v":"1.4"},{"$f":"ListaCriterios!D27","v":"Promoción"},{"$f":"ListaCriterios!E27","v":"1.4.1"},{"$f":"ListaCriterios!F27","v":"Comunicación, promoción y señalización"},{"$f":"ListaCriterios!G27","v":"SOCIAL"},{"$f":"ListaCriterios!H27","v":"1.4.1.b"},{"$f":"ListaCriterios!I27","v":0},{"$f":"ListaCriterios!J27","v":"Se realizan acciones periódicas de revisión y mejora de la estrategia de comunicación"},{"$f":"ListaCriterios!K27","v":"SI/NO"},{"$f":"IF(VLOOKUP(J27,'1.ASP SOCIALES Y COM'!I:K,3,FALSE)=\"\",\"no_data\",VLOOKUP(J27,'1.ASP SOCIALES Y COM'!I:K,3,FALSE))","v":"no_data"},0,5,0,0,1,0,5,0,{"$f":"ListaCriterios!O27","v":0}]
[{"$f":"ListaCriterios!A28","v":1},{"$f":"ListaCriterios!B28","v":"Aspectos sociales y comunicación"},{"$f":"ListaCriterios!C28","v":"1.4"},{"$f":"ListaCriterios!D28","v":"Promoción"},{"$f":"ListaCriterios!E28","v":"1.4.1"},{"$f":"ListaCriterios!F28","v":"Comunicación, promoción y señalización"},{"$f":"ListaCriterios!G28","v":"SOCIAL"},{"$f":"ListaCriterios!H28","v":"1.4.1.c"},{"$f":"ListaCriterios!I28","v":"X"},{"$f":"ListaCriterios!J28","v":"¿Se utiliza de forma clara y definida la imagen corporativa?"},{"$f":"ListaCriterios!K28","v":"SI/NO"},{"$f":"IF(VLOOKUP(J28,'1.ASP SOCIALES Y COM'!I:K,3,FALSE)=\"\",\"no_data\",VLOOKUP(J28,'1.ASP SOCIALES Y COM'!I:K,3,FALSE))","v":"no_data"},0,5,0,0,3,0,15,0,{"$f":"ListaCriterios!O28","v":"Promover y/o participar en jornadas, eventos o proyectos que fomenten la responsabilidad social (respecto medio ambiente, igualdad género, inserción laboral etc.)"}]
[{"$f":"ListaCriterios!A29","v":1},{"$f":"ListaCriterios!B29","v":"Aspectos sociales y comunicación"},{"$f":"ListaCriterios!C29","v":"1.4"},{"$f":"ListaCriterios!D29","v":"Promoción"},{"$f":"ListaCriterios!E29","v":"1.4.1"},{"$f":"ListaCriterios!F29","v":"Comunicación, promoción y señalización"},{"$f":"ListaCriterios!G29","v":"SOCIAL"},{"$f":"ListaCriterios!H29","v":"1.4.1.d"},{"$f":"ListaCriterios!I29","v":"X"},{"$f":"ListaCriterios!J29","v":"¿La entidad cuenta con una estrategia o política de comunicación con objetivos claros, definidos y conocidos por sus integrantes?"},{"$f":"ListaCriterios!K29","v":"SI/NO"},{"$f":"IF(VLOOKUP(J29,'1.ASP SOCIALES Y COM'!I:K,3,FALSE)=\"\",\"no_data\",VLOOKUP(J29,'1.ASP SOCIALES Y COM'!I:K,3,FALSE))","v":"no_data"},0,5,0,0,3,0,15,0,{"$f":"ListaCriterios!O29","v":"Aprobar una estrategia/política de comunicación"}]
[{"$f":"ListaCriterios!A30","v":1},{"$f":"ListaCriterios!B30","v":"Aspectos sociales y comunicación"},{"$f":"ListaCriterios!C30","v":"1.4"},{"$f":"ListaCriterios!D30","v":"Promoción"},{"$f":"ListaCriterios!E30","v":"1.4.1"},{"$f":"ListaCriterios!F30","v":"Comunicación, promoción y señalización"},{"$f":"ListaCriterios!G30","v":"SOCIAL"},{"$f":"ListaCriterios!H30","v":"1.4.1.e"},{"$f":"ListaCriterios!I30","v":"X"},{"$f":"ListaCriterios!J30","v":"¿Se tiene una recopilación de impactos y presencia de polígono o de la entidad de gestión en los medios de comunicación?"},{"$f":"ListaCriterios!K30","v":"SI/NO"},{"$f":"IF(VLOOKUP(J30,'1.ASP SOCIALES Y COM'!I:K,3,FALSE)=\"\",\"no_data\",VLOOKUP(J30,'1.ASP SOCIALES Y COM'!I:K,3,FALSE))","v":"no_data"},0,5,0,0,3,0,15,0,{"$f":"ListaCriterios!O30","v":"Registrar las apariciones de la asociación o equivalente y de sus empresas en los medios de comunicación"}]
[{"$f":"ListaCriterios!A31","v":1},{"$f":"ListaCriterios!B31","v":"Aspectos sociales y comunicación"},{"$f":"ListaCriterios!C31","v":"1.4"},{"$f":"ListaCriterios!D31","v":"Promoción"},{"$f":"ListaCriterios!E31","v":"1.4.1"},{"$f":"ListaCriterios!F31","v":"Comunicación, promoción y señalización"},{"$f":"ListaCriterios!G31","v":"SOCIAL"},{"$f":"ListaCriterios!H31","v":"1.4.1.f"},{"$f":"ListaCriterios!I31","v":0},{"$f":"ListaCriterios!J31","v":"Grado de presencia en redes sociales"},{"$f":"ListaCriterios!K31","v":"Grad 1-5"},{"$f":"IF(VLOOKUP(J31,'1.ASP SOCIALES Y COM'!I:K,3,FALSE)=\"\",\"no_data\",VLOOKUP(J31,'1.ASP SOCIALES Y COM'!I:K,3,FALSE))","v":"no_data"},0,5,0,0,1,0,5,0,{"$f":"ListaCriterios!O31","v":0}]
[{"$f":"ListaCriterios!A32","v":1},{"$f":"ListaCriterios!B32","v":"Aspectos sociales y comunicación"},{"$f":"ListaCriterios!C32","v":"1.4"},{"$f":"ListaCriterios!D32","v":"Promoción"},{"$f":"ListaCriterios!E32","v":"1.4.1"},{"$f":"ListaCriterios!F32","v":"Comunicación, promoción y señalización"},{"$f":"ListaCriterios!G32","v":"SOCIAL"},{"$f":"ListaCriterios!H32","v":"1.4.1.g"},{"$f":"ListaCriterios!I32","v":"X"},{"$f":"ListaCriterios!J32","v":"¿Se han promovido / participado en jornadas, eventos o proyectos que fomenten la responsabilidad social (respecto medio ambiente, igualdad género, inserción laboral etc.)?"},{"$f":"ListaCriterios!K32","v":"SI/NO"},{"$f":"IF(VLOOKUP(J32,'1.ASP SOCIALES Y COM'!I:K,3,FALSE)=\"\",\"no_data\",VLOOKUP(J32,'1.ASP SOCIALES Y COM'!I:K,3,FALSE))","v":"no_data"},0,5,0,0,3,0,15,0,{"$f":"ListaCriterios!O32","v":"Promover y/o participar en jornadas o proyectos con objetivos sociales y/o ambientales"}]
[{"$f":"ListaCriterios!A33","v":2},{"$f":"ListaCriterios!B33","v":"Gestión de los recursos"},{"$f":"ListaCriterios!C33","v":"2.1"},{"$f":"ListaCriterios!D33","v":"agua"},{"$f":"ListaCriterios!E33","v":"2.1.1"},{"$f":"ListaCriterios!F33","v":"Eficiencia en el consumo de agua"},{"$f":"ListaCriterios!G33","v":"AGUA"},{"$f":"ListaCriterios!H33","v":"2.1.1.a"},{"$f":"ListaCriterios!I33","v":"X"},{"$f":"ListaCriterios!J33","v":"¿Se dispone de herramientas por control y datos de consumo de agua (gestor hídrico)?"},{"$f":"ListaCriterios!K33","v":"SI/NO"},{"$f":"IF(VLOOKUP(J33,'2.GESTIÓN DE LOS RECURSOS'!I:K,3,FALSE)=\"\",\"no_data\",VLOOKUP(J33,'2.GESTIÓN DE LOS RECURSOS'!I:K,3,FALSE))","v":"no_data"},0,5,0,0,3,0,15,0,{"$f":"ListaCriterios!O33","v":"Obtener datos de consumo de agua de las empresas con el máximo nivel de detalle y actualización, avanzando hacia la figura del gestor hídrico"}]
[{"$f":"ListaCriterios!A34","v":2},{"$f":"ListaCriterios!B34","v":"Gestión de los recursos"},{"$f":"ListaCriterios!C34","v":"2.1"},{"$f":"ListaCriterios!D34","v":"agua"},{"$f":"ListaCriterios!E34","v":"2.1.2"},{"$f":"ListaCriterios!F34","v":"Conocimiento sobre aguas residuales"},{"$f":"ListaCriterios!G34","v":"AGUA"},{"$f":"ListaCriterios!H34","v":"2.1.2.a"},{"$f":"ListaCriterios!I34","v":0},{"$f":"ListaCriterios!J34","v":"¿Se dispone de Información disponible sobre calidad y tipos de agua residual?"},{"$f":"ListaCriterios!K34","v":"SI/NO"},{"$f":"IF(VLOOKUP(J34,'2.GESTIÓN DE LOS RECURSOS'!I:K,3,FALSE)=\"\",\"no_data\",VLOOKUP(J34,'2.GESTIÓN DE LOS RECURSOS'!I:K,3,FALSE))","v":"no_data"},0,5,0,0,2,0,10,0,{"$f":"ListaCriterios!O34","v":0}]
[{"$f":"ListaCriterios!A35","v":2},{"$f":"ListaCriterios!B35","v":"Gestión de los recursos"},{"$f":"ListaCriterios!C35","v":"2.2"},{"$f":"ListaCriterios!D35","v":"Energía y cambio climático"},{"$f":"ListaCriterios!E35","v":"2.2.1"},{"$f":"ListaCriterios!F35","v":"Gestión energética"},{"$f":"ListaCriterios!G35","v":"ENERGÍA Y CAMBIO CLIMATIC"},{"$f":"ListaCriterios!H35","v":"2.2.1.a"},{"$f":"ListaCriterios!I35","v":"X"},{"$f":"ListaCriterios!J35","v":"¿Se dispone de información sobre el consumo eléctrico?"},{"$f":"ListaCriterios!K35","v":"Grad 1-5"},{"$f":"IF(VLOOKUP(J35,'2.GESTIÓN DE LOS RECURSOS'!I:K,3,FALSE)=\"\",\"no_data\",VLOOKUP(J35,'2.GESTIÓN DE LOS RECURSOS'!I:K,3,FALSE))","v":"no_data"},0,5,0,0,3,0,15,0,{"$f":"ListaCriterios!O35","v":"Obtener datos de consumo eléctrico a las empresas con el máximo nivel de detalle y actualización, avanzando hacia la figura del gestor energético."}]
[{"$f":"ListaCriterios!A36","v":2},{"$f":"ListaCriterios!B36","v":"Gestión de los recursos"},{"$f":"ListaCriterios!C36","v":"2.2"},{"$f":"ListaCriterios!D36","v":"Energía y cambio climático"},{"$f":"ListaCriterios!E36","v":"2.2.1"},{"$f":"ListaCriterios!F36","v":"Gestión energética"},{"$f":"ListaCriterios!G36","v":"ENERGÍA Y CAMBIO CLIMATIC"},{"$f":"ListaCriterios!H36","v":"2.2.1.b"},{"$f":"ListaCriterios!I36","v":"X"},{"$f":"ListaCriterios!J36","v":"¿Se dispone de información sobre el consumo térmico?"},{"$f":"ListaCriterios!K36","v":"Grad 1-5"},{"$f":"IF(VLOOKUP(J36,'2.GESTIÓN DE LOS RECURSOS'!I:K,3,FALSE)=\"\",\"no_data\",VLOOKUP(J36,'2.GESTIÓN DE LOS RECURSOS'!I:K,3,FALSE))","v":"no_data"},0,5,0,0,3,0,15,0,{"$f":"ListaCriterios!O36","v":"Obtener datos de consumo térmico las empresas con el máximo nivel de detalle y actualización, avanzando hacia la figura del gestor energético."}]
[{"$f":"ListaCriterios!A37","v":2},{"$f":"ListaCriterios!B37","v":"Gestión de los recursos"},{"$f":"ListaCriterios!C37","v":"2.2"},{"$f":"ListaCriterios!D37","v":"Energía y cambio climático"},{"$f":"ListaCriterios!E37","v":"2.2.2"},{"$f":"ListaCriterios!F37","v":"Producción de energía renovable"},{"$f":"ListaCriterios!G37","v":"ENERGÍA Y CAMBIO CLIMATIC"},{"$f":"ListaCriterios!H37","v":"2.2.2.a"},{"$f":"ListaCriterios!I37","v":"x"},{"$f":"ListaCriterios!J37","v":"¿Se dispone de información sobre la producción de energía renovable en las empresas?"},{"$f":"ListaCriterios!K37","v":"SI/NO"},{"$f":"IF(VLOOKUP(J37,'2.GESTIÓN DE LOS RECURSOS'!I:K,3,FALSE)=\"\",\"no_data\",VLOOKUP(J37,'2.GESTIÓN DE LOS RECURSOS'!I:K,3,FALSE))","v":"no_data"},0,5,0,0,3,0,15,0,{"$f":"ListaCriterios!O37","v":"Disponer de los datos de producción de energías renovables en el PAE"}]
[{"$f":"ListaCriterios!A38","v":2},{"$f":"ListaCriterios!B38","v":"Gestión de los recursos"},{"$f":"ListaCriterios!C38","v":"2.2"},{"$f":"ListaCriterios!D38","v":"Energía y cambio climático"},{"$f":"ListaCriterios!E38","v":"2.2.2"},{"$f":"ListaCriterios!F38","v":"Producción de energía renovable"},{"$f":"ListaCriterios!G38","v":"ENERGÍA Y CAMBIO CLIMATIC"},{"$f":"ListaCriterios!H38","v":"2.2.2.b"},{"$f":"ListaCriterios!I38","v":"X"},{"$f":"ListaCriterios!J38","v":"¿Se dispone de espacio para la creación de infraestructuras para producción de e.renovable?"},{"$f":"ListaCriterios!K38","v":"SI/NO"},{"$f":"IF(VLOOKUP(J38,'2.GESTIÓN DE LOS RECURSOS'!I:K,3,FALSE)=\"\",\"no_data\",VLOOKUP(J38,'2.GESTIÓN DE LOS RECURSOS'!I:K,3,FALSE))","v":"no_data"},0,5,0,0,3,0,15,0,{"$f":"ListaCriterios!O38","v":"Disponer o realizar reservas de espacio para poder crear infraestructuras energéticas"}]
[{"$f":"ListaCriterios!A39","v":2},{"$f":"ListaCriterios!B39","v":"Gestión de los recursos"},{"$f":"ListaCriterios!C39","v":"2.2"},{"$f":"ListaCriterios!D39","v":"Energía y cambio climático"},{"$f":"ListaCriterios!E39","v":"2.2.2"},{"$f":"ListaCriterios!F39","v":"Producción de energía renovable"},{"$f":"ListaCriterios!G39","v":"ENERGÍA Y CAMBIO CLIMATIC"},{"$f":"ListaCriterios!H39","v":"2.2.2.c"},{"$f":"ListaCriterios!I39","v":"x"},{"$f":"ListaCriterios!J39","v":"¿Existen infraestructuras de producción (planta biomasa, parque solar…)?"},{"$f":"ListaCriterios!K39","v":"SI/NO"},{"$f":"IF(VLOOKUP(J39,'2.GESTIÓN DE LOS RECURSOS'!I:K,3,FALSE)=\"\",\"no_data\",VLOOKUP(J39,'2.GESTIÓN DE LOS RECURSOS'!I:K,3,FALSE))","v":"no_data"},0,5,0,0,3,0,15,0,{"$f":"ListaCriterios!O39","v":"Disponer de infraestructuras de producción de energía renovable."}]
[{"$f":"ListaCriterios!A40","v":2},{"$f":"ListaCriterios!B40","v":"Gestión de los recursos"},{"$f":"ListaCriterios!C40","v":"2.2"},{"$f":"ListaCriterios!D40","v":"Energía y cambio climático"},{"$f":"ListaCriterios!E40","v":"2.2.3"},{"$f":"ListaCriterios!F40","v":"Autoproducción y generación compartida"},{"$f":"ListaCriterios!G40","v":"ENERGÍA Y CAMBIO CLIMATIC"},{"$f":"ListaCriterios!H40","v":"2.2.3.a"},{"$f":"ListaCriterios!I40","v":"x"},{"$f":"ListaCriterios!J40","v":"¿Existe alguna comunidad energética?"},{"$f":"ListaCriterios!K40","v":"Grad 1-5"},{"$f":"IF(VLOOKUP(J40,'2.GESTIÓN DE LOS RECURSOS'!I:K,3,FALSE)=\"\",\"no_data\",VLOOKUP(J40,'2.GESTIÓN DE LOS RECURSOS'!I:K,3,FALSE))","v":"no_data"},0,5,0,0,3,0,15,0,{"$f":"ListaCriterios!O40","v":"Fomentar y/o participar en una comunidad energética local que incorpore a empresas del PAE"}]
[{"$f":"ListaCriterios!A41","v":2},{"$f":"ListaCriterios!B41","v":"Gestión de los recursos"},{"$f":"ListaCriterios!C41","v":"2.2"},{"$f":"ListaCriterios!D41","v":"Energía y cambio climático"},{"$f":"ListaCriterios!E41","v":"2.2.4"},{"$f":"ListaCriterios!F41","v":"Potencial de producción e.solar/eolica"},{"$f":"ListaCriterios!G41","v":"ENERGÍA Y CAMBIO CLIMATIC"},{"$f":"ListaCriterios!H41","v":"2.2.4.a"},{"$f":"ListaCriterios!I41","v":"x"},{"$f":"ListaCriterios!J41","v":"¿Se dispone de información sobre el potencial de producción solar?"},{"$f":"ListaCriterios!K41","v":"SI/NO"},{"$f":"IF(VLOOKUP(J41,'2.GESTIÓN DE LOS RECURSOS'!I:K,3,FALSE)=\"\",\"no_data\",VLOOKUP(J41,'2.GESTIÓN DE LOS RECURSOS'!I:K,3,FALSE))","v":"no_data"},0,5,0,0,3,0,15,0,{"$f":"ListaCriterios!O41","v":"Elaborar un estudio del potencial de producción de energía solar fotovoltaica/térmica en el PAE"}]
[{"$f":"ListaCriterios!A42","v":2},{"$f":"ListaCriterios!B42","v":"Gestión de los recursos"},{"$f":"ListaCriterios!C42","v":"2.2"},{"$f":"ListaCriterios!D42","v":"Energía y cambio climático"},{"$f":"ListaCriterios!E42","v":"2.2.4"},{"$f":"ListaCriterios!F42","v":"Potencial de producción e.solar/eolica"},{"$f":"ListaCriterios!G42","v":"ENERGÍA Y CAMBIO CLIMATIC"},{"$f":"ListaCriterios!H42","v":"2.2.4.b"},{"$f":"ListaCriterios!I42","v":"x"},{"$f":"ListaCriterios!J42","v":"¿Se dispone de información sobre el potencial de producción eólico? ¿Existen registros o estacion de medida viento?"},{"$f":"ListaCriterios!K42","v":"SI/NO"},{"$f":"IF(VLOOKUP(J42,'2.GESTIÓN DE LOS RECURSOS'!I:K,3,FALSE)=\"\",\"no_data\",VLOOKUP(J42,'2.GESTIÓN DE LOS RECURSOS'!I:K,3,FALSE))","v":"no_data"},0,5,0,0,3,0,15,0,{"$f":"ListaCriterios!O42","v":"Disponer de información sobre el potencial de producción eólica y/o registros o estacion de medida viento."}]
[{"$f":"ListaCriterios!A43","v":2},{"$f":"ListaCriterios!B43","v":"Gestión de los recursos"},{"$f":"ListaCriterios!C43","v":"2.2"},{"$f":"ListaCriterios!D43","v":"Energía y cambio climático"},{"$f":"ListaCriterios!E43","v":"2.2.5"},{"$f":"ListaCriterios!F43","v":"Análisis de eficiencia energética para las empresas"},{"$f":"ListaCriterios!G43","v":"ENERGÍA Y CAMBIO CLIMATIC"},{"$f":"ListaCriterios!H43","v":"2.2.5.a"},{"$f":"ListaCriterios!I43","v":"x"},{"$f":"ListaCriterios!J43","v":"¿Se han analizado medidas de eficiencia por las empresas, tales como termografías (aéreas oa pie) o asesoramientos personalidades?"},{"$f":"ListaCriterios!K43","v":"SI/NO"},{"$f":"IF(VLOOKUP(J43,'2.GESTIÓN DE LOS RECURSOS'!I:K,3,FALSE)=\"\",\"no_data\",VLOOKUP(J43,'2.GESTIÓN DE LOS RECURSOS'!I:K,3,FALSE))","v":"no_data"},0,5,0,0,3,0,15,0,{"$f":"ListaCriterios!O43","v":"Realizar estudios o iniciar un servicio para el fomento de la eficiencia energética en las empresas."}]
[{"$f":"ListaCriterios!A44","v":2},{"$f":"ListaCriterios!B44","v":"Gestión de los recursos"},{"$f":"ListaCriterios!C44","v":"2.2"},{"$f":"ListaCriterios!D44","v":"Energía y cambio climático"},{"$f":"ListaCriterios!E44","v":"2.2.6"},{"$f":"ListaCriterios!F44","v":"Gases Efecto Invernadero"},{"$f":"ListaCriterios!G44","v":"ENERGÍA Y CAMBIO CLIMATIC"},{"$f":"ListaCriterios!H44","v":"2.2.6.a"},{"$f":"ListaCriterios!I44","v":"x"},{"$f":"ListaCriterios!J44","v":"Se tiene conocimiento de otras fuentes difusas de GEI (CFC's, COVs…)"},{"$f":"ListaCriterios!K44","v":"SI/NO"},{"$f":"IF(VLOOKUP(J44,'2.GESTIÓN DE LOS RECURSOS'!I:K,3,FALSE)=\"\",\"no_data\",VLOOKUP(J44,'2.GESTIÓN DE LOS RECURSOS'!I:K,3,FALSE))","v":"no_data"},0,5,0,0,3,0,15,0,{"$f":"ListaCriterios!O44","v":"Obtener datos de otras fuentes difusas de GEI (CFC's, COVs…)"}]
[{"$f":"ListaCriterios!A45","v":2},{"$f":"ListaCriterios!B45","v":"Gestión de los recursos"},{"$f":"ListaCriterios!C45","v":"2.2"},{"$f":"ListaCriterios!D45","v":"Energía y cambio climático"},{"$f":"ListaCriterios!E45","v":"2.2.6"},{"$f":"ListaCriterios!F45","v":"Gases Efecto Invernadero"},{"$f":"ListaCriterios!G45","v":"ENERGÍA Y CAMBIO CLIMATIC"},{"$f":"ListaCriterios!H45","v":"2.2.6.b"},{"$f":"ListaCriterios!I45","v":"x"},{"$f":"ListaCriterios!J45","v":"¿Se ofrece asistencia a las empresas para acogerse a algún sistema de comensación de emisiones?"},{"$f":"ListaCriterios!K45","v":"SI/NO"},{"$f":"IF(VLOOKUP(J45,'2.GESTIÓN DE LOS RECURSOS'!I:K,3,FALSE)=\"\",\"no_data\",VLOOKUP(J45,'2.GESTIÓN DE LOS RECURSOS'!I:K,3,FALSE))","v":"no_data"},0,5,0,0,3,0,15,0,{"$f":"ListaCriterios!O45","v":"Ofrecer a las empresas un sistema de compensación de emisiones, preferiblemente con proyectos locales"}]
[{"$f":"ListaCriterios!A46","v":2},{"$f":"ListaCriterios!B46","v":"Gestión de los recursos"},{"$f":"ListaCriterios!C46","v":"2.2"},{"$f":"ListaCriterios!D46","v":"Energía y cambio climático"},{"$f":"ListaCriterios!E46","v":"2.2.6"},{"$f":"ListaCriterios!F46","v":"Gases Efecto Invernadero"},{"$f":"ListaCriterios!G46","v":"ENERGÍA Y CAMBIO CLIMATIC"},{"$f":"ListaCriterios!H46","v":"2.2.6.c"},{"$f":"ListaCriterios!I46","v":"x"},{"$f":"ListaCriterios!J46","v":"¿La gestión del polígono compensa sus emisiones?"},{"$f":"ListaCriterios!K46","v":"SI/NO"},{"$f":"IF(VLOOKUP(J46,'2.GESTIÓN DE LOS RECURSOS'!I:K,3,FALSE)=\"\",\"no_data\",VLOOKUP(J46,'2.GESTIÓN DE LOS RECURSOS'!I:K,3,FALSE))","v":"no_data"},0,5,0,0,3,0,15,0,{"$f":"ListaCriterios!O46","v":"Compensar sus emisiones relativas a las actividades de gestión del PAE"}]
[{"$f":"ListaCriterios!A47","v":2},{"$f":"ListaCriterios!B47","v":"Gestión de los recursos"},{"$f":"ListaCriterios!C47","v":"2.3"},{"$f":"ListaCriterios!D47","v":"Materia prima y producción"},{"$f":"ListaCriterios!E47","v":"2.3.1"},{"$f":"ListaCriterios!F47","v":"Matería local"},{"$f":"ListaCriterios!G47","v":"MATERIALES"},{"$f":"ListaCriterios!H47","v":"2.3.1.a"},{"$f":"ListaCriterios!I47","v":"x"},{"$f":"ListaCriterios!J47","v":"Se dispone de información o estudios sobre los recursos materiales de entrada y salida (materias primas, producción…)"},{"$f":"ListaCriterios!K47","v":"SI/NO"},{"$f":"IF(VLOOKUP(J47,'2.GESTIÓN DE LOS RECURSOS'!I:K,3,FALSE)=\"\",\"no_data\",VLOOKUP(J47,'2.GESTIÓN DE LOS RECURSOS'!I:K,3,FALSE))","v":"no_data"},0,5,0,0,3,0,15,0,{"$f":"ListaCriterios!O47","v":"Obtener información y/o estudiar los flujos de materiales en el PAE, con datos de consumo de materias primas y producción material"}]
[{"$f":"ListaCriterios!A48","v":2},{"$f":"ListaCriterios!B48","v":"Gestión de los recursos"},{"$f":"ListaCriterios!C48","v":"2.3"},{"$f":"ListaCriterios!D48","v":"Materia prima y producción"},{"$f":"ListaCriterios!E48","v":"2.3.2"},{"$f":"ListaCriterios!F48","v":"Tipología de actividad para optimizar recursos"},{"$f":"ListaCriterios!G48","v":"MATERIALES"},{"$f":"ListaCriterios!H48","v":"2.3.2.a"},{"$f":"ListaCriterios!I48","v":0},{"$f":"ListaCriterios!J48","v":"¿Cuál es el grado de conocimiento de las actividades presentes?"},{"$f":"ListaCriterios!K48","v":"Grad 1-5"},{"$f":"IF(VLOOKUP(J48,'2.GESTIÓN DE LOS RECURSOS'!I:K,3,FALSE)=\"\",\"no_data\",VLOOKUP(J48,'2.GESTIÓN DE LOS RECURSOS'!I:K,3,FALSE))","v":"no_data"},0,5,0,0,2,0,10,0,{"$f":"ListaCriterios!O48","v":0}]
[{"$f":"ListaCriterios!A49","v":2},{"$f":"ListaCriterios!B49","v":"Gestión de los recursos"},{"$f":"ListaCriterios!C49","v":"2.3"},{"$f":"ListaCriterios!D49","v":"Materia prima y producción"},{"$f":"ListaCriterios!E49","v":"2.3.2"},{"$f":"ListaCriterios!F49","v":"Tipología de actividad para optimizar recursos"},{"$f":"ListaCriterios!G49","v":"MATERIALES"},{"$f":"ListaCriterios!H49","v":"2.3.2.b"},{"$f":"ListaCriterios!I49","v":"x"},{"$f":"ListaCriterios!J49","v":"¿Se ha realizado un análisis del ecosistema/metabolismo industrial?"},{"$f":"ListaCriterios!K49","v":"SI/NO"},{"$f":"IF(VLOOKUP(J49,'2.GESTIÓN DE LOS RECURSOS'!I:K,3,FALSE)=\"\",\"no_data\",VLOOKUP(J49,'2.GESTIÓN DE LOS RECURSOS'!I:K,3,FALSE))","v":"no_data"},0,5,0,0,3,0,15,0,{"$f":"ListaCriterios!O49","v":"Realizar un análisis del ecosistema/metabolismo industrial"}]
[{"$f":"ListaCriterios!A50","v":2},{"$f":"ListaCriterios!B50","v":"Gestión de los recursos"},{"$f":"ListaCriterios!C50","v":"2.4"},{"$f":"ListaCriterios!D50","v":"Residuos"},{"$f":"ListaCriterios!E50","v":"2.4.1"},{"$f":"ListaCriterios!F50","v":"Generación de residuos"},{"$f":"ListaCriterios!G50","v":"RESIDUOS"},{"$f":"ListaCriterios!H50","v":"2.4.1.a"},{"$f":"ListaCriterios!I50","v":"x"},{"$f":"ListaCriterios!J50","v":"¿Se dispone de datos de generación de residuos global del PAE?"},{"$f":"ListaCriterios!K50","v":"SI/NO"},{"$f":"IF(VLOOKUP(J50,'2.GESTIÓN DE LOS RECURSOS'!I:K,3,FALSE)=\"\",\"no_data\",VLOOKUP(J50,'2.GESTIÓN DE LOS RECURSOS'!I:K,3,FALSE))","v":"no_data"},0,5,0,0,3,0,15,0,{"$f":"ListaCriterios!O50","v":"Solicitar al ARC (Generalitat de Catalunya) y obtener los datos de generación de residuos de las empresas del PAE"}]
[{"$f":"ListaCriterios!A51","v":2},{"$f":"ListaCriterios!B51","v":"Gestión de los recursos"},{"$f":"ListaCriterios!C51","v":"2.4"},{"$f":"ListaCriterios!D51","v":"Residuos"},{"$f":"ListaCriterios!E51","v":"2.4.1"},{"$f":"ListaCriterios!F51","v":"Generación de residuos"},{"$f":"ListaCriterios!G51","v":"RESIDUOS"},{"$f":"ListaCriterios!H51","v":"2.4.1.b"},{"$f":"ListaCriterios!I51","v":"x"},{"$f":"ListaCriterios!J51","v":"¿Existe algún tipo de política, estrategia o se han realizado actividades dentro del concepto Zero-Waste?"},{"$f":"ListaCriterios!K51","v":"Grad 1-5"},{"$f":"IF(VLOOKUP(J51,'2.GESTIÓN DE LOS RECURSOS'!I:K,3,FALSE)=\"\",\"no_data\",VLOOKUP(J51,'2.GESTIÓN DE LOS RECURSOS'!I:K,3,FALSE))","v":"no_data"},0,5,0,0,3,0,15,0,{"$f":"ListaCriterios!O51","v":"Aprobar una política, definir estrategias y realizar actividades para la reducción de residuos, tanto en la gestión como en las empresas del PAE"}]
[{"$f":"ListaCriterios!A52","v":2},{"$f":"ListaCriterios!B52","v":"Gestión de los recursos"},{"$f":"ListaCriterios!C52","v":"2.4"},{"$f":"ListaCriterios!D52","v":"Residuos"},{"$f":"ListaCriterios!E52","v":"2.4.2"},{"$f":"ListaCriterios!F52","v":"Valorización de residuos"},{"$f":"ListaCriterios!G52","v":"RESIDUOS"},{"$f":"ListaCriterios!H52","v":"2.4.2.a"},{"$f":"ListaCriterios!I52","v":"x"},{"$f":"ListaCriterios!J52","v":"¿Existen políticas de gestión y/o valorización compartida de residuos?"},{"$f":"ListaCriterios!K52","v":"SI/NO"},{"$f":"IF(VLOOKUP(J52,'2.GESTIÓN DE LOS RECURSOS'!I:K,3,FALSE)=\"\",\"no_data\",VLOOKUP(J52,'2.GESTIÓN DE LOS RECURSOS'!I:K,3,FALSE))","v":"no_data"},0,5,0,0,3,0,15,0,{"$f":"ListaCriterios!O52","v":"Identificar y fomentar iniciativas para el reciclaje y recuperación de residuos de forma compartida"}]
[{"$f":"ListaCriterios!A53","v":2},{"$f":"ListaCriterios!B53","v":"Gestión de los recursos"},{"$f":"ListaCriterios!C53","v":"2.4"},{"$f":"ListaCriterios!D53","v":"Residuos"},{"$f":"ListaCriterios!E53","v":"2.4.2"},{"$f":"ListaCriterios!F53","v":"Valorización de residuos"},{"$f":"ListaCriterios!G53","v":"RESIDUOS"},{"$f":"ListaCriterios!H53","v":"2.4.2.b"},{"$f":"ListaCriterios!I53","v":0},{"$f":"ListaCriterios!J53","v":"¿Existen valorizadores de residuos en el propio PAE?"},{"$f":"ListaCriterios!K53","v":"SI/NO"},{"$f":"IF(VLOOKUP(J53,'2.GESTIÓN DE LOS RECURSOS'!I:K,3,FALSE)=\"\",\"no_data\",VLOOKUP(J53,'2.GESTIÓN DE LOS RECURSOS'!I:K,3,FALSE))","v":"no_data"},0,5,0,0,2,0,10,0,{"$f":"ListaCriterios!O53","v":0}]
[{"$f":"ListaCriterios!A54","v":2},{"$f":"ListaCriterios!B54","v":"Gestión de los recursos"},{"$f":"ListaCriterios!C54","v":"2.4"},{"$f":"ListaCriterios!D54","v":"Residuos"},{"$f":"ListaCriterios!E54","v":"2.4.2"},{"$f":"ListaCriterios!F54","v":"Valorización de residuos"},{"$f":"ListaCriterios!G54","v":"RESIDUOS"},{"$f":"ListaCriterios!H54","v":"2.4.2.c"},{"$f":"ListaCriterios!I54","v":"x"},{"$f":"ListaCriterios!J54","v":"¿Se dispone de espacios reservados o disponibles por infraestructuras de la gestión de residuos individual o compartida?"},{"$f":"ListaCriterios!K54","v":"SI/NO"},{"$f":"IF(VLOOKUP(J54,'2.GESTIÓN DE LOS RECURSOS'!I:K,3,FALSE)=\"\",\"no_data\",VLOOKUP(J54,'2.GESTIÓN DE LOS RECURSOS'!I:K,3,FALSE))","v":"no_data"},0,5,0,0,3,0,15,0,{"$f":"ListaCriterios!O54","v":"Disponer o realizar reservas de espacio para poder crear infraestructuras para la valorización de residuos"}]
[{"$f":"ListaCriterios!A55","v":2},{"$f":"ListaCriterios!B55","v":"Gestión de los recursos"},{"$f":"ListaCriterios!C55","v":"2.4"},{"$f":"ListaCriterios!D55","v":"Residuos"},{"$f":"ListaCriterios!E55","v":"2.4.3"},{"$f":"ListaCriterios!F55","v":"Generación de residuos"},{"$f":"ListaCriterios!G55","v":"RESIDUOS"},{"$f":"ListaCriterios!H55","v":"2.4.3.a"},{"$f":"ListaCriterios!I55","v":0},{"$f":"ListaCriterios!J55","v":"¿Se han elaborado materiales para la difusión y concienciación en materia de gestión de residuos (reducción, reutilización y reciclaje)?"},{"$f":"ListaCriterios!K55","v":"SI/NO"},{"$f":"IF(VLOOKUP(J55,'2.GESTIÓN DE LOS RECURSOS'!I:K,3,FALSE)=\"\",\"no_data\",VLOOKUP(J55,'2.GESTIÓN DE LOS RECURSOS'!I:K,3,FALSE))","v":"no_data"},0,5,0,0,2,0,10,0,{"$f":"ListaCriterios!O55","v":0}]
[{"$f":"ListaCriterios!A56","v":2},{"$f":"ListaCriterios!B56","v":"Gestión de los recursos"},{"$f":"ListaCriterios!C56","v":"2.4"},{"$f":"ListaCriterios!D56","v":"Residuos"},{"$f":"ListaCriterios!E56","v":"2.4.4"},{"$f":"ListaCriterios!F56","v":"Recogida de residuos"},{"$f":"ListaCriterios!G56","v":"RESIDUOS"},{"$f":"ListaCriterios!H56","v":"2.4.4.a"},{"$f":"ListaCriterios!I56","v":0},{"$f":"ListaCriterios!J56","v":"(En caso de corresponder la gestión en el área empresarial): ¿Se encuentran disponibles los documentos legales asociados a la gestión de residuos (transportista/gestor)?"},{"$f":"ListaCriterios!K56","v":"SI/NO"},{"$f":"IF(VLOOKUP(J56,'2.GESTIÓN DE LOS RECURSOS'!I:K,3,FALSE)=\"\",\"no_data\",VLOOKUP(J56,'2.GESTIÓN DE LOS RECURSOS'!I:K,3,FALSE))","v":"no_data"},0,5,0,0,2,0,10,0,{"$f":"ListaCriterios!O56","v":0}]
[{"$f":"ListaCriterios!A57","v":2},{"$f":"ListaCriterios!B57","v":"Gestión de los recursos"},{"$f":"ListaCriterios!C57","v":"2.4"},{"$f":"ListaCriterios!D57","v":"Residuos"},{"$f":"ListaCriterios!E57","v":"2.4.4"},{"$f":"ListaCriterios!F57","v":"Recogida de residuos"},{"$f":"ListaCriterios!G57","v":"RESIDUOS"},{"$f":"ListaCriterios!H57","v":"2.4.4.b"},{"$f":"ListaCriterios!I57","v":0},{"$f":"ListaCriterios!J57","v":"(En caso de corresponder la gestión en el área) : ¿Se dispone de los contratos con la empresa proveedora del servicio de gestión de residuos?"},{"$f":"ListaCriterios!K57","v":"SI/NO"},{"$f":"IF(VLOOKUP(J57,'2.GESTIÓN DE LOS RECURSOS'!I:K,3,FALSE)=\"\",\"no_data\",VLOOKUP(J57,'2.GESTIÓN DE LOS RECURSOS'!I:K,3,FALSE))","v":"no_data"},0,5,0,0,2,0,10,0,{"$f":"ListaCriterios!O57","v":0}]
[{"$f":"ListaCriterios!A58","v":2},{"$f":"ListaCriterios!B58","v":"Gestión de los recursos"},{"$f":"ListaCriterios!C58","v":"2.4"},{"$f":"ListaCriterios!D58","v":"Residuos"},{"$f":"ListaCriterios!E58","v":"2.4.4"},{"$f":"ListaCriterios!F58","v":"Recogida de residuos"},{"$f":"ListaCriterios!G58","v":"RESIDUOS"},{"$f":"ListaCriterios!H58","v":"2.4.4.c"},{"$f":"ListaCriterios!I58","v":0},{"$f":"ListaCriterios!J58","v":"Existen papeleras en número y estado de conservación adecuado a las necesidades del PAE"},{"$f":"ListaCriterios!K58","v":"Grad 1-5"},{"$f":"IF(VLOOKUP(J58,'2.GESTIÓN DE LOS RECURSOS'!I:K,3,FALSE)=\"\",\"no_data\",VLOOKUP(J58,'2.GESTIÓN DE LOS RECURSOS'!I:K,3,FALSE))","v":"no_data"},0,5,0,0,2,0,10,0,{"$f":"ListaCriterios!O58","v":0}]
[{"$f":"ListaCriterios!A59","v":2},{"$f":"ListaCriterios!B59","v":"Gestión de los recursos"},{"$f":"ListaCriterios!C59","v":"2.4"},{"$f":"ListaCriterios!D59","v":"Residuos"},{"$f":"ListaCriterios!E59","v":"2.4.4"},{"$f":"ListaCriterios!F59","v":"Recogida de residuos"},{"$f":"ListaCriterios!G59","v":"RESIDUOS"},{"$f":"ListaCriterios!H59","v":"2.4.4.d"},{"$f":"ListaCriterios!I59","v":0},{"$f":"ListaCriterios!J59","v":"¿Existen contenedores de recogida municipal en la vía pública? (negativo)"},{"$f":"ListaCriterios!K59","v":"SI/NO"},{"$f":"IF(VLOOKUP(J59,'2.GESTIÓN DE LOS RECURSOS'!I:K,3,FALSE)=\"\",\"no_data\",VLOOKUP(J59,'2.GESTIÓN DE LOS RECURSOS'!I:K,3,FALSE))","v":"no_data"},0,5,0,0,2,0,10,0,{"$f":"ListaCriterios!O59","v":0}]
[{"$f":"ListaCriterios!A60","v":2},{"$f":"ListaCriterios!B60","v":"Gestión de los recursos"},{"$f":"ListaCriterios!C60","v":"2.5"},{"$f":"ListaCriterios!D60","v":"Simbiosis industrial"},{"$f":"ListaCriterios!E60","v":"2.5.1"},{"$f":"ListaCriterios!F60","v":"Especialización productiva en los PAE"},{"$f":"ListaCriterios!G60","v":"MATERIALES"},{"$f":"ListaCriterios!H60","v":"2.5.1.a"},{"$f":"ListaCriterios!I60","v":"x"},{"$f":"ListaCriterios!J60","v":"¿Existen políticas para la implantación/promoción según tipos de actividades/especialización?"},{"$f":"ListaCriterios!K60","v":"SI/NO"},{"$f":"IF(VLOOKUP(J60,'2.GESTIÓN DE LOS RECURSOS'!I:K,3,FALSE)=\"\",\"no_data\",VLOOKUP(J60,'2.GESTIÓN DE LOS RECURSOS'!I:K,3,FALSE))","v":"no_data"},0,5,0,0,3,0,15,0,{"$f":"ListaCriterios!O60","v":"Definir políticas de selección de las empresas que se implanten según su actividad, para fomentar la simbiosis industrial"}]
[{"$f":"ListaCriterios!A61","v":2},{"$f":"ListaCriterios!B61","v":"Gestión de los recursos"},{"$f":"ListaCriterios!C61","v":"2.5"},{"$f":"ListaCriterios!D61","v":"Simbiosis industrial"},{"$f":"ListaCriterios!E61","v":"2.5.2"},{"$f":"ListaCriterios!F61","v":"Potencialidad de simbiosis industrial"},{"$f":"ListaCriterios!G61","v":"MATERIALES"},{"$f":"ListaCriterios!H61","v":"2.5.2.a"},{"$f":"ListaCriterios!I61","v":"x"},{"$f":"ListaCriterios!J61","v":"¿Existe algún servicio de simbiosis industrial o equivalente?"},{"$f":"ListaCriterios!K61","v":"Grad 1-5"},{"$f":"IF(VLOOKUP(J61,'2.GESTIÓN DE LOS RECURSOS'!I:K,3,FALSE)=\"\",\"no_data\",VLOOKUP(J61,'2.GESTIÓN DE LOS RECURSOS'!I:K,3,FALSE))","v":"no_data"},0,5,0,0,3,0,15,0,{"$f":"ListaCriterios!O61","v":"Participar o generar iniciativas de fomento de la simbiosis industrial, y trabajar para crear una verdadera oficina/servicio de simbiosis"}]
[{"$f":"ListaCriterios!A62","v":2},{"$f":"ListaCriterios!B62","v":"Gestión de los recursos"},{"$f":"ListaCriterios!C62","v":"2.5"},{"$f":"ListaCriterios!D62","v":"Simbiosis industrial"},{"$f":"ListaCriterios!E62","v":"2.5.2"},{"$f":"ListaCriterios!F62","v":"Potencialidad de simbiosis industrial"},{"$f":"ListaCriterios!G62","v":"MATERIALES"},{"$f":"ListaCriterios!H62","v":"2.5.2.b"},{"$f":"ListaCriterios!I62","v":"x"},{"$f":"ListaCriterios!J62","v":"¿Se ha realizado algún estudio del potencial de simbiosis industrial en el PAE o en su territorio?"},{"$f":"ListaCriterios!K62","v":"SI/NO"},{"$f":"IF(VLOOKUP(J62,'2.GESTIÓN DE LOS RECURSOS'!I:K,3,FALSE)=\"\",\"no_data\",VLOOKUP(J62,'2.GESTIÓN DE LOS RECURSOS'!I:K,3,FALSE))","v":"no_data"},0,5,0,0,3,0,15,0,{"$f":"ListaCriterios!O62","v":"Estudiar el potencial de sombiosis industrial en el ámbito del PAE"}]
[{"$f":"ListaCriterios!A63","v":2},{"$f":"ListaCriterios!B63","v":"Gestión de los recursos"},{"$f":"ListaCriterios!C63","v":"2.5"},{"$f":"ListaCriterios!D63","v":"Simbiosis industrial"},{"$f":"ListaCriterios!E63","v":"2.5.3"},{"$f":"ListaCriterios!F63","v":"Reaprovechamiento de recurso-residuo"},{"$f":"ListaCriterios!G63","v":"RESIDUOS"},{"$f":"ListaCriterios!H63","v":"2.5.3.a"},{"$f":"ListaCriterios!I63","v":"x"},{"$f":"ListaCriterios!J63","v":"¿Se realizan acciones técnicas o divulgativas que fomenten la recuperación de recursos y residuos en el PAE?"},{"$f":"ListaCriterios!K63","v":"SI/NO"},{"$f":"IF(VLOOKUP(J63,'2.GESTIÓN DE LOS RECURSOS'!I:K,3,FALSE)=\"\",\"no_data\",VLOOKUP(J63,'2.GESTIÓN DE LOS RECURSOS'!I:K,3,FALSE))","v":"no_data"},0,5,0,0,3,0,15,0,{"$f":"ListaCriterios!O63","v":"Realizar acciones para fomentar la recuperación de recursos y residuos en el PAE"}]
[{"$f":"ListaCriterios!A64","v":2},{"$f":"ListaCriterios!B64","v":"Gestión de los recursos"},{"$f":"ListaCriterios!C64","v":"2.5"},{"$f":"ListaCriterios!D64","v":"Simbiosis industrial"},{"$f":"ListaCriterios!E64","v":"2.5.3"},{"$f":"ListaCriterios!F64","v":"Reaprovechamiento de recurso-residuo"},{"$f":"ListaCriterios!G64","v":"RESIDUOS"},{"$f":"ListaCriterios!H64","v":"2.5.3.b"},{"$f":"ListaCriterios!I64","v":"x"},{"$f":"ListaCriterios!J64","v":"¿Se conoce la cantidad de residuos que se recuperan en el propio PAE?"},{"$f":"ListaCriterios!K64","v":"SI/NO"},{"$f":"IF(VLOOKUP(J64,'2.GESTIÓN DE LOS RECURSOS'!I:K,3,FALSE)=\"\",\"no_data\",VLOOKUP(J64,'2.GESTIÓN DE LOS RECURSOS'!I:K,3,FALSE))","v":"no_data"},0,5,0,0,3,0,15,0,{"$f":"ListaCriterios!O64","v":"Disponer de los datos de residuos que realmente se recuperen."}]
[{"$f":"ListaCriterios!A65","v":3},{"$f":"ListaCriterios!B65","v":"Infrastructuras y servicios"},{"$f":"ListaCriterios!C65","v":"3.1"},{"$f":"ListaCriterios!D65","v":"Infrastructuras avanzadas"},{"$f":"ListaCriterios!E65","v":"3.1.1"},{"$f":"ListaCriterios!F65","v":"Red separativa de aguas (pluviales, grises)"},{"$f":"ListaCriterios!G65","v":"AGUA"},{"$f":"ListaCriterios!H65","v":"3.1.1.a"},{"$f":"ListaCriterios!I65","v":"x"},{"$f":"ListaCriterios!J65","v":"¿Existe red de separativa de aguas pluviales?"},{"$f":"ListaCriterios!K65","v":"Grad 1-5"},{"$f":"IF(VLOOKUP(J65,'3.INFRASTRUCTURAS Y SERVICIOS'!I:K,3,FALSE)=\"\",\"no_data\",VLOOKUP(J65,'3.INFRASTRUCTURAS Y SERVICIOS'!I:K,3,FALSE))","v":"no_data"},0,5,0,0,3,0,15,0,{"$f":"ListaCriterios!O65","v":"Proyectar y ejecutar una red de aguas pluviales, separada de las aguas grises y residuales"}]
[{"$f":"ListaCriterios!A66","v":3},{"$f":"ListaCriterios!B66","v":"Infrastructuras y servicios"},{"$f":"ListaCriterios!C66","v":"3.1"},{"$f":"ListaCriterios!D66","v":"Infrastructuras avanzadas"},{"$f":"ListaCriterios!E66","v":"3.1.1"},{"$f":"ListaCriterios!F66","v":"Red separativa de aguas (pluviales, grises)"},{"$f":"ListaCriterios!G66","v":"AGUA"},{"$f":"ListaCriterios!H66","v":"3.1.1.b"},{"$f":"ListaCriterios!I66","v":"x"},{"$f":"ListaCriterios!J66","v":"¿Existe red de separativa de aguas grises?"},{"$f":"ListaCriterios!K66","v":"Grad 1-5"},{"$f":"IF(VLOOKUP(J66,'3.INFRASTRUCTURAS Y SERVICIOS'!I:K,3,FALSE)=\"\",\"no_data\",VLOOKUP(J66,'3.INFRASTRUCTURAS Y SERVICIOS'!I:K,3,FALSE))","v":"no_data"},{"$f":"IF(L66=\"no_data\",0,(IF(K66=\"SI/NO\",IF(L66=\"Sí\",N66,IF(L66=\"No\",O66,P66)),L66)))","v":0},5,0,0,3,0,15,0,{"$f":"ListaCriterios!O66","v":"Proyectar y ejecutar una red de aguas grises, separada de las aguas grises y residuales"}]
[{"$f":"ListaCriterios!A67","v":3},{"$f":"ListaCriterios!B67","v":"Infrastructuras y servicios"},{"$f":"ListaCriterios!C67","v":"3.1"},{"$f":"ListaCriterios!D67","v":"Infrastructuras avanzadas"},{"$f":"ListaCriterios!E67","v":"3.1.1"},{"$f":"ListaCriterios!F67","v":"Red separativa de aguas (pluviales, grises)"},{"$f":"ListaCriterios!G67","v":"AGUA"},{"$f":"ListaCriterios!H67","v":"3.1.1.c"},{"$f":"ListaCriterios!I67","v":"x"},{"$f":"ListaCriterios!J67","v":"¿Se dispone de algún sistema de recogida para el aprovechamiento de aguas pluviales?"},{"$f":"ListaCriterios!K67","v":"SI/NO"},{"$f":"IF(VLOOKUP(J67,'3.INFRASTRUCTURAS Y SERVICIOS'!I:K,3,FALSE)=\"\",\"no_data\",VLOOKUP(J67,'3.INFRASTRUCTURAS Y SERVICIOS'!I:K,3,FALSE))","v":"no_data"},0,5,0,0,3,{"$f":"M67*Q67","v":0},{"$f":"Q67*5","v":15},{"$f":"M67/S67","v":0},{"$f":"ListaCriterios!O67","v":"Proyectar y ejecutar un sistema de recogida y aprovechamiento de aguas pluviales"}]
[{"$f":"ListaCriterios!A68","v":3},{"$f":"ListaCriterios!B68","v":"Infrastructuras y servicios"},{"$f":"ListaCriterios!C68","v":"3.1"},{"$f":"ListaCriterios!D68","v":"Infrastructuras avanzadas"},{"$f":"ListaCriterios!E68","v":"3.1.2"},{"$f":"ListaCriterios!F68","v":"Infraestructuras avanzadas para la economía circular"},{"$f":"ListaCriterios!G68","v":"COLABORACIÓN"},{"$f":"ListaCriterios!H68","v":"3.1.2.a"},{"$f":"ListaCriterios!I68","v":"x"},{"$f":"ListaCriterios!J68","v":"¿Se ha realizado algún estudio de necesidades/oportunidades de infraestructuras avanzadas (p.ej. biorefinería, planta biogas)?"},{"$f":"ListaCriterios!K68","v":"SI/NO"},{"$f":"IF(VLOOKUP(J68,'3.INFRASTRUCTURAS Y SERVICIOS'!I:K,3,FALSE)=\"\",\"no_data\",VLOOKUP(J68,'3.INFRASTRUCTURAS Y SERVICIOS'!I:K,3,FALSE))","v":"no_data"},0,5,0,0,3,0,15,0,{"$f":"ListaCriterios!O68","v":"Realizar un estudio del potencial de implantación de infraestructuras avanzadas como biorefineras, plantas de biogás, etc."}]
[{"$f":"ListaCriterios!A69","v":3},{"$f":"ListaCriterios!B69","v":"Infrastructuras y servicios"},{"$f":"ListaCriterios!C69","v":"3.1"},{"$f":"ListaCriterios!D69","v":"Infrastructuras avanzadas"},{"$f":"ListaCriterios!E69","v":"3.1.2"},{"$f":"ListaCriterios!F69","v":"Infraestructuras avanzadas para la economía circular"},{"$f":"ListaCriterios!G69","v":"COLABORACIÓN"},{"$f":"ListaCriterios!H69","v":"3.1.2.b"},{"$f":"ListaCriterios!I69","v":"x"},{"$f":"ListaCriterios!J69","v":"¿Existe alguna infraestructura del tipo: biorefinería, planta biogas, banco de ensayos de materiales, EDAR específica por tipos de aguas, …?"},{"$f":"ListaCriterios!K69","v":"Grad 0-5"},{"$f":"IF(VLOOKUP(J69,'3.INFRASTRUCTURAS Y SERVICIOS'!I:K,3,FALSE)=\"\",\"no_data\",VLOOKUP(J69,'3.INFRASTRUCTURAS Y SERVICIOS'!I:K,3,FALSE))","v":"no_data"},0,5,0,0,3,0,15,0,{"$f":"ListaCriterios!O69","v":"Captar empresas y/o fomentar la cración de infraestructuras ambientales avanzadas como biorefinería, planta biogas, banco de ensayos de materiales, EDAR específica por tipos de aguas, etc."}]
[{"$f":"ListaCriterios!A70","v":3},{"$f":"ListaCriterios!B70","v":"Infrastructuras y servicios"},{"$f":"ListaCriterios!C70","v":"3.1"},{"$f":"ListaCriterios!D70","v":"Infrastructuras avanzadas"},{"$f":"ListaCriterios!E70","v":"3.1.3"},{"$f":"ListaCriterios!F70","v":"Energía compartida (calor, electricidad)"},{"$f":"ListaCriterios!G70","v":"ENERGÍA Y CAMBIO CLIMATIC"},{"$f":"ListaCriterios!H70","v":"3.1.3.a"},{"$f":"ListaCriterios!I70","v":"x"},{"$f":"ListaCriterios!J70","v":"¿Existe alguna central de producción de energía renovable gestionada por el PAE?"},{"$f":"ListaCriterios!K70","v":"SI/NO"},{"$f":"IF(VLOOKUP(J70,'3.INFRASTRUCTURAS Y SERVICIOS'!I:K,3,FALSE)=\"\",\"no_data\",VLOOKUP(J70,'3.INFRASTRUCTURAS Y SERVICIOS'!I:K,3,FALSE))","v":"no_data"},0,5,0,0,3,0,15,0,{"$f":"ListaCriterios!O70","v":"Crear una central de producción de energía renovable, de gestión pública o participada por la asociación"}]
[{"$f":"ListaCriterios!A71","v":3},{"$f":"ListaCriterios!B71","v":"Infrastructuras y servicios"},{"$f":"ListaCriterios!C71","v":"3.1"},{"$f":"ListaCriterios!D71","v":"Infrastructuras avanzadas"},{"$f":"ListaCriterios!E71","v":"3.1.3"},{"$f":"ListaCriterios!F71","v":"Energía compartida (calor, electricidad)"},{"$f":"ListaCriterios!G71","v":"ENERGÍA Y CAMBIO CLIMATIC"},{"$f":"ListaCriterios!H71","v":"3.1.3.b"},{"$f":"ListaCriterios!I71","v":"x"},{"$f":"ListaCriterios!J71","v":"Existe alguna infraestructura relacionada con la acumulación de energía (baterías), y/o smart grids"},{"$f":"ListaCriterios!K71","v":"SI/NO"},{"$f":"IF(VLOOKUP(J71,'3.INFRASTRUCTURAS Y SERVICIOS'!I:K,3,FALSE)=\"\",\"no_data\",VLOOKUP(J71,'3.INFRASTRUCTURAS Y SERVICIOS'!I:K,3,FALSE))","v":"no_data"},0,5,0,0,3,0,15,0,{"$f":"ListaCriterios!O71","v":"Fomentar y/o participar en infraestructuras de gestión energética como baterías industriales, smart grids, etc."}]
[{"$f":"ListaCriterios!A72","v":3},{"$f":"ListaCriterios!B72","v":"Infrastructuras y servicios"},{"$f":"ListaCriterios!C72","v":"3.1"},{"$f":"ListaCriterios!D72","v":"Infrastructuras avanzadas"},{"$f":"ListaCriterios!E72","v":"3.1.4"},{"$f":"ListaCriterios!F72","v":"Redes de calor y frío"},{"$f":"ListaCriterios!G72","v":"ENERGÍA Y CAMBIO CLIMATIC"},{"$f":"ListaCriterios!H72","v":"3.1.4.a"},{"$f":"ListaCriterios!I72","v":"x"},{"$f":"ListaCriterios!J72","v":"¿Existe red de distribución de calor?"},{"$f":"ListaCriterios!K72","v":"SI/NO"},{"$f":"IF(VLOOKUP(J72,'3.INFRASTRUCTURAS Y SERVICIOS'!I:K,3,FALSE)=\"\",\"no_data\",VLOOKUP(J72,'3.INFRASTRUCTURAS Y SERVICIOS'!I:K,3,FALSE))","v":"no_data"},0,5,0,0,3,0,15,0,{"$f":"ListaCriterios!O72","v":"Fomentar y/o participar en la creación de redes de producción de calor"}]
[{"$f":"ListaCriterios!A73","v":3},{"$f":"ListaCriterios!B73","v":"Infrastructuras y servicios"},{"$f":"ListaCriterios!C73","v":"3.1"},{"$f":"ListaCriterios!D73","v":"Infrastructuras avanzadas"},{"$f":"ListaCriterios!E73","v":"3.1.4"},{"$f":"ListaCriterios!F73","v":"Redes de calor y frío"},{"$f":"ListaCriterios!G73","v":"ENERGÍA Y CAMBIO CLIMATIC"},{"$f":"ListaCriterios!H73","v":"3.1.4.b"},{"$f":"ListaCriterios!I73","v":"x"},{"$f":"ListaCriterios!J73","v":"¿Existe red de distribución de frío?"},{"$f":"ListaCriterios!K73","v":"SI/NO"},{"$f":"IF(VLOOKUP(J73,'3.INFRASTRUCTURAS Y SERVICIOS'!I:K,3,FALSE)=\"\",\"no_data\",VLOOKUP(J73,'3.INFRASTRUCTURAS Y SERVICIOS'!I:K,3,FALSE))","v":"no_data"},0,5,0,0,3,0,15,0,{"$f":"ListaCriterios!O73","v":"Fomentar y/o participar en la creación de redes de producción de frío"}]
[{"$f":"ListaCriterios!A74","v":3},{"$f":"ListaCriterios!B74","v":"Infrastructuras y servicios"},{"$f":"ListaCriterios!C74","v":"3.1"},{"$f":"ListaCriterios!D74","v":"Infrastructuras avanzadas"},{"$f":"ListaCriterios!E74","v":"3.1.4"},{"$f":"ListaCriterios!F74","v":"Redes de calor y frío"},{"$f":"ListaCriterios!G74","v":"ENERGÍA Y CAMBIO CLIMATIC"},{"$f":"ListaCriterios!H74","v":"3.1.4.c"},{"$f":"ListaCriterios!I74","v":"x"},{"$f":"ListaCriterios!J74","v":"Si no hay redes, ¿hay previsión de espacio en zanjas para extenderla?"},{"$f":"ListaCriterios!K74","v":"SI/NO"},{"$f":"IF(VLOOKUP(J74,'3.INFRASTRUCTURAS Y SERVICIOS'!I:K,3,FALSE)=\"\",\"no_data\",VLOOKUP(J74,'3.INFRASTRUCTURAS Y SERVICIOS'!I:K,3,FALSE))","v":"no_data"},0,5,0,0,3,0,15,0,{"$f":"ListaCriterios!O74","v":"Disponer o realizar reservas de espacio de zanjas por redes, si no se dispone de ellas"}]
[{"$f":"ListaCriterios!A75","v":3},{"$f":"ListaCriterios!B75","v":"Infrastructuras y servicios"},{"$f":"ListaCriterios!C75","v":"3.1"},{"$f":"ListaCriterios!D75","v":"Infrastructuras avanzadas"},{"$f":"ListaCriterios!E75","v":"3.1.4"},{"$f":"ListaCriterios!F75","v":"Redes de calor y frío"},{"$f":"ListaCriterios!G75","v":"ENERGÍA Y CAMBIO CLIMATIC"},{"$f":"ListaCriterios!H75","v":"3.1.4.d"},{"$f":"ListaCriterios!I75","v":"x"},{"$f":"ListaCriterios!J75","v":"¿Se ha estudiado la viabilidad de una red de calor/frío?"},{"$f":"ListaCriterios!K75","v":"SI/NO"},{"$f":"IF(VLOOKUP(J75,'3.INFRASTRUCTURAS Y SERVICIOS'!I:K,3,FALSE)=\"\",\"no_data\",VLOOKUP(J75,'3.INFRASTRUCTURAS Y SERVICIOS'!I:K,3,FALSE))","v":"no_data"},0,5,0,0,3,0,15,0,{"$f":"ListaCriterios!O75","v":"Realizar un estudio del potencial de redes de calor/frío en el ámbito del PAE"}]
[{"$f":"ListaCriterios!A76","v":3},{"$f":"ListaCriterios!B76","v":"Infrastructuras y servicios"},{"$f":"ListaCriterios!C76","v":"3.1"},{"$f":"ListaCriterios!D76","v":"Infrastructuras avanzadas"},{"$f":"ListaCriterios!E76","v":"3.1.5"},{"$f":"ListaCriterios!F76","v":"Recarga VE"},{"$f":"ListaCriterios!G76","v":"MOVILIDAD"},{"$f":"ListaCriterios!H76","v":"3.1.5.a"},{"$f":"ListaCriterios!I76","v":"x"},{"$f":"ListaCriterios!J76","v":"Concentración (num/1000 trabajadores) de puntos de recarga por vehículos eléctricos accesibles a trabajadores y visitantes"},{"$f":"ListaCriterios!K76","v":"Grad 1-5"},{"$f":"IF(VLOOKUP(J76,'3.INFRASTRUCTURAS Y SERVICIOS'!I:K,3,FALSE)=\"\",\"no_data\",VLOOKUP(J76,'3.INFRASTRUCTURAS Y SERVICIOS'!I:K,3,FALSE))","v":"no_data"},0,5,0,0,3,0,15,0,{"$f":"ListaCriterios!O76","v":"Instalar y/o fomentar la instalación de puntos de recarga por vehículos eléctricos"}]
[{"$f":"ListaCriterios!A77","v":3},{"$f":"ListaCriterios!B77","v":"Infrastructuras y servicios"},{"$f":"ListaCriterios!C77","v":"3.1"},{"$f":"ListaCriterios!D77","v":"Infrastructuras avanzadas"},{"$f":"ListaCriterios!E77","v":"3.1.5"},{"$f":"ListaCriterios!F77","v":"Recarga VE"},{"$f":"ListaCriterios!G77","v":"MOVILIDAD"},{"$f":"ListaCriterios!H77","v":"3.1.5.a"},{"$f":"ListaCriterios!I77","v":"x"},{"$f":"ListaCriterios!J77","v":"¿Existe alguna fotolinera en el PAE?"},{"$f":"ListaCriterios!K77","v":"SI/NO"},{"$f":"IF(VLOOKUP(J77,'3.INFRASTRUCTURAS Y SERVICIOS'!I:K,3,FALSE)=\"\",\"no_data\",VLOOKUP(J77,'3.INFRASTRUCTURAS Y SERVICIOS'!I:K,3,FALSE))","v":"no_data"},0,5,0,0,3,0,15,0,{"$f":"ListaCriterios!O77","v":"Instalar y/o fomentar la instalación de una fotolinera (zona de recarga rápida de vehículos eléctricos)"}]
[{"$f":"ListaCriterios!A78","v":3},{"$f":"ListaCriterios!B78","v":"Infrastructuras y servicios"},{"$f":"ListaCriterios!C78","v":"3.2"},{"$f":"ListaCriterios!D78","v":"Infrastructuras básicas"},{"$f":"ListaCriterios!E78","v":"3.2.1"},{"$f":"ListaCriterios!F78","v":"Abastecimiento de agua"},{"$f":"ListaCriterios!G78","v":"AGUA"},{"$f":"ListaCriterios!H78","v":"3.2.01.a"},{"$f":"ListaCriterios!I78","v":"x"},{"$f":"ListaCriterios!J78","v":"¿Se ha realizado un estudio de detección de fugas en el sistema de distribución de agua?"},{"$f":"ListaCriterios!K78","v":"SI/NO"},{"$f":"IF(VLOOKUP(J78,'3.INFRASTRUCTURAS Y SERVICIOS'!I:K,3,FALSE)=\"\",\"no_data\",VLOOKUP(J78,'3.INFRASTRUCTURAS Y SERVICIOS'!I:K,3,FALSE))","v":"no_data"},0,5,0,0,3,0,15,0,{"$f":"ListaCriterios!O78","v":"Estudiar el rendimiento del sistema de distribución de agua potable analizando posibles fugas"}]
[{"$f":"ListaCriterios!A79","v":3},{"$f":"ListaCriterios!B79","v":"Infrastructuras y servicios"},{"$f":"ListaCriterios!C79","v":"3.2"},{"$f":"ListaCriterios!D79","v":"Infrastructuras básicas"},{"$f":"ListaCriterios!E79","v":"3.2.1"},{"$f":"ListaCriterios!F79","v":"Abastecimiento de agua"},{"$f":"ListaCriterios!G79","v":"AGUA"},{"$f":"ListaCriterios!H79","v":"3.2.01.b"},{"$f":"ListaCriterios!I79","v":0},{"$f":"ListaCriterios!J79","v":"¿Se dispone de información sobre la relación Agua facturada/Agua consumida?"},{"$f":"ListaCriterios!K79","v":"SI/NO"},{"$f":"IF(VLOOKUP(J79,'3.INFRASTRUCTURAS Y SERVICIOS'!I:K,3,FALSE)=\"\",\"no_data\",VLOOKUP(J79,'3.INFRASTRUCTURAS Y SERVICIOS'!I:K,3,FALSE))","v":"no_data"},0,5,0,0,2,0,10,0,{"$f":"ListaCriterios!O79","v":0}]
[{"$f":"ListaCriterios!A80","v":3},{"$f":"ListaCriterios!B80","v":"Infrastructuras y servicios"},{"$f":"ListaCriterios!C80","v":"3.2"},{"$f":"ListaCriterios!D80","v":"Infrastructuras básicas"},{"$f":"ListaCriterios!E80","v":"3.2.1"},{"$f":"ListaCriterios!F80","v":"Abastecimiento de agua"},{"$f":"ListaCriterios!G80","v":"AGUA"},{"$f":"ListaCriterios!H80","v":"3.2.01.c"},{"$f":"ListaCriterios!I80","v":0},{"$f":"ListaCriterios!J80","v":"En caso de disponer de información, ¿cuál es la eficiencia de la red de distribución (%)?"},{"$f":"ListaCriterios!K80","v":"Grad 1-5"},{"$f":"IF(VLOOKUP(J80,'3.INFRASTRUCTURAS Y SERVICIOS'!I:K,3,FALSE)=\"\",\"no_data\",VLOOKUP(J80,'3.INFRASTRUCTURAS Y SERVICIOS'!I:K,3,FALSE))","v":"no_data"},0,5,0,0,2,0,10,0,{"$f":"ListaCriterios!O80","v":0}]
[{"$f":"ListaCriterios!A81","v":3},{"$f":"ListaCriterios!B81","v":"Infrastructuras y servicios"},{"$f":"ListaCriterios!C81","v":"3.2"},{"$f":"ListaCriterios!D81","v":"Infrastructuras básicas"},{"$f":"ListaCriterios!E81","v":"3.2.1"},{"$f":"ListaCriterios!F81","v":"Abastecimiento de agua"},{"$f":"ListaCriterios!G81","v":"AGUA"},{"$f":"ListaCriterios!H81","v":"3.2.01.d"},{"$f":"ListaCriterios!I81","v":0},{"$f":"ListaCriterios!J81","v":"¿Cuál es la disponibilidad de agua de pozos y/o aguas pluviales (cualitativo)?"},{"$f":"ListaCriterios!K81","v":"Grad 1-5"},{"$f":"IF(VLOOKUP(J81,'3.INFRASTRUCTURAS Y SERVICIOS'!I:K,3,FALSE)=\"\",\"no_data\",VLOOKUP(J81,'3.INFRASTRUCTURAS Y SERVICIOS'!I:K,3,FALSE))","v":"no_data"},0,5,0,0,2,0,10,0,{"$f":"ListaCriterios!O81","v":0}]
[{"$f":"ListaCriterios!A82","v":3},{"$f":"ListaCriterios!B82","v":"Infrastructuras y servicios"},{"$f":"ListaCriterios!C82","v":"3.2"},{"$f":"ListaCriterios!D82","v":"Infrastructuras básicas"},{"$f":"ListaCriterios!E82","v":"3.2.1"},{"$f":"ListaCriterios!F82","v":"Abastecimiento de agua"},{"$f":"ListaCriterios!G82","v":"AGUA"},{"$f":"ListaCriterios!H82","v":"3.2.01.h"},{"$f":"ListaCriterios!I82","v":0},{"$f":"ListaCriterios!J82","v":"(En caso de existir depósitos para abastecimiento) El acceso a los depósitos se restringe a las personas autorizadas"},{"$f":"ListaCriterios!K82","v":"SI/NO"},{"$f":"IF(VLOOKUP(J82,'3.INFRASTRUCTURAS Y SERVICIOS'!I:K,3,FALSE)=\"\",\"no_data\",VLOOKUP(J82,'3.INFRASTRUCTURAS Y SERVICIOS'!I:K,3,FALSE))","v":"no_data"},0,5,0,0,2,0,10,0,{"$f":"ListaCriterios!O82","v":0}]
[{"$f":"ListaCriterios!A83","v":3},{"$f":"ListaCriterios!B83","v":"Infrastructuras y servicios"},{"$f":"ListaCriterios!C83","v":"3.2"},{"$f":"ListaCriterios!D83","v":"Infrastructuras básicas"},{"$f":"ListaCriterios!E83","v":"3.2.1"},{"$f":"ListaCriterios!F83","v":"Abastecimiento de agua"},{"$f":"ListaCriterios!G83","v":"AGUA"},{"$f":"ListaCriterios!H83","v":"3.2.01.i"},{"$f":"ListaCriterios!I83","v":0},{"$f":"ListaCriterios!J83","v":"(En caso de existir depósitos para abastecimiento) Los depósitos se encuentran bien conservados y limpios"},{"$f":"ListaCriterios!K83","v":"SI/NO"},{"$f":"IF(VLOOKUP(J83,'3.INFRASTRUCTURAS Y SERVICIOS'!I:K,3,FALSE)=\"\",\"no_data\",VLOOKUP(J83,'3.INFRASTRUCTURAS Y SERVICIOS'!I:K,3,FALSE))","v":"no_data"},0,5,0,0,2,0,10,0,{"$f":"ListaCriterios!O83","v":0}]
[{"$f":"ListaCriterios!A84","v":3},{"$f":"ListaCriterios!B84","v":"Infrastructuras y servicios"},{"$f":"ListaCriterios!C84","v":"3.2"},{"$f":"ListaCriterios!D84","v":"Infrastructuras básicas"},{"$f":"ListaCriterios!E84","v":"3.2.1"},{"$f":"ListaCriterios!F84","v":"Abastecimiento de agua"},{"$f":"ListaCriterios!G84","v":"AGUA"},{"$f":"ListaCriterios!H84","v":"3.2.01.j"},{"$f":"ListaCriterios!I84","v":0},{"$f":"ListaCriterios!J84","v":"¿Se dispone de planos de la red de abastecimiento de agua?"},{"$f":"ListaCriterios!K84","v":"SI/NO"},{"$f":"IF(VLOOKUP(J84,'3.INFRASTRUCTURAS Y SERVICIOS'!I:K,3,FALSE)=\"\",\"no_data\",VLOOKUP(J84,'3.INFRASTRUCTURAS Y SERVICIOS'!I:K,3,FALSE))","v":"no_data"},0,5,0,0,2,0,10,0,{"$f":"ListaCriterios!O84","v":0}]
[{"$f":"ListaCriterios!A85","v":3},{"$f":"ListaCriterios!B85","v":"Infrastructuras y servicios"},{"$f":"ListaCriterios!C85","v":"3.2"},{"$f":"ListaCriterios!D85","v":"Infrastructuras básicas"},{"$f":"ListaCriterios!E85","v":"3.2.1"},{"$f":"ListaCriterios!F85","v":"Abastecimiento de agua"},{"$f":"ListaCriterios!G85","v":"AGUA"},{"$f":"ListaCriterios!H85","v":"3.2.01.k"},{"$f":"ListaCriterios!I85","v":0},{"$f":"ListaCriterios!J85","v":"Se dispone del contrato de prestación de servicio de abastecimiento de agua (por ejemplo, adjudicación pública del servicio)"},{"$f":"ListaCriterios!K85","v":"SI/NO"},{"$f":"IF(VLOOKUP(J85,'3.INFRASTRUCTURAS Y SERVICIOS'!I:K,3,FALSE)=\"\",\"no_data\",VLOOKUP(J85,'3.INFRASTRUCTURAS Y SERVICIOS'!I:K,3,FALSE))","v":"no_data"},0,5,0,0,2,0,10,0,{"$f":"ListaCriterios!O85","v":0}]
[{"$f":"ListaCriterios!A86","v":3},{"$f":"ListaCriterios!B86","v":"Infrastructuras y servicios"},{"$f":"ListaCriterios!C86","v":"3.2"},{"$f":"ListaCriterios!D86","v":"Infrastructuras básicas"},{"$f":"ListaCriterios!E86","v":"3.2.1"},{"$f":"ListaCriterios!F86","v":"Abastecimiento de agua"},{"$f":"ListaCriterios!G86","v":"AGUA"},{"$f":"ListaCriterios!H86","v":"3.2.01.l"},{"$f":"ListaCriterios!I86","v":0},{"$f":"ListaCriterios!J86","v":"¿Se tienen disponibles analíticas periódicas sobre la potabilidad del agua de consumo?"},{"$f":"ListaCriterios!K86","v":"SI/NO"},{"$f":"IF(VLOOKUP(J86,'3.INFRASTRUCTURAS Y SERVICIOS'!I:K,3,FALSE)=\"\",\"no_data\",VLOOKUP(J86,'3.INFRASTRUCTURAS Y SERVICIOS'!I:K,3,FALSE))","v":"no_data"},0,5,0,0,2,0,10,0,{"$f":"ListaCriterios!O86","v":0}]
[{"$f":"ListaCriterios!A87","v":3},{"$f":"ListaCriterios!B87","v":"Infrastructuras y servicios"},{"$f":"ListaCriterios!C87","v":"3.2"},{"$f":"ListaCriterios!D87","v":"Infrastructuras básicas"},{"$f":"ListaCriterios!E87","v":"3.2.1"},{"$f":"ListaCriterios!F87","v":"Abastecimiento de agua"},{"$f":"ListaCriterios!G87","v":"AGUA"},{"$f":"ListaCriterios!H87","v":"3.2.01.m"},{"$f":"ListaCriterios!I87","v":0},{"$f":"ListaCriterios!J87","v":"¿Se dispone de documentos oficiales que reflejan las principales características de la red de abastecimiento de agua (por ejemplo pliego condiciones técnicas de prestación de servicio)?"},{"$f":"ListaCriterios!K87","v":"SI/NO"},{"$f":"IF(VLOOKUP(J87,'3.INFRASTRUCTURAS Y SERVICIOS'!I:K,3,FALSE)=\"\",\"no_data\",VLOOKUP(J87,'3.INFRASTRUCTURAS Y SERVICIOS'!I:K,3,FALSE))","v":"no_data"},0,5,0,0,2,0,10,0,{"$f":"ListaCriterios!O87","v":0}]
[{"$f":"ListaCriterios!A88","v":3},{"$f":"ListaCriterios!B88","v":"Infrastructuras y servicios"},{"$f":"ListaCriterios!C88","v":"3.2"},{"$f":"ListaCriterios!D88","v":"Infrastructuras básicas"},{"$f":"ListaCriterios!E88","v":"3.2.1"},{"$f":"ListaCriterios!F88","v":"Abastecimiento de agua"},{"$f":"ListaCriterios!G88","v":"AGUA"},{"$f":"ListaCriterios!H88","v":"3.2.01.n"},{"$f":"ListaCriterios!I88","v":0},{"$f":"ListaCriterios!J88","v":"¿El caudal de la red de abastecimiento es adecuado a las necesidades del área?"},{"$f":"ListaCriterios!K88","v":"SI/NO"},{"$f":"IF(VLOOKUP(J88,'3.INFRASTRUCTURAS Y SERVICIOS'!I:K,3,FALSE)=\"\",\"no_data\",VLOOKUP(J88,'3.INFRASTRUCTURAS Y SERVICIOS'!I:K,3,FALSE))","v":"no_data"},0,5,0,0,2,0,10,0,{"$f":"ListaCriterios!O88","v":0}]
[{"$f":"ListaCriterios!A89","v":3},{"$f":"ListaCriterios!B89","v":"Infrastructuras y servicios"},{"$f":"ListaCriterios!C89","v":"3.2"},{"$f":"ListaCriterios!D89","v":"Infrastructuras básicas"},{"$f":"ListaCriterios!E89","v":"3.2.1"},{"$f":"ListaCriterios!F89","v":"Abastecimiento de agua"},{"$f":"ListaCriterios!G89","v":"AGUA"},{"$f":"ListaCriterios!H89","v":"3.2.01.o"},{"$f":"ListaCriterios!I89","v":0},{"$f":"ListaCriterios!J89","v":"En caso de competencia exclusiva del área, ¿los materiales empleados son los adecuados y se cumple la legislación vigente?"},{"$f":"ListaCriterios!K89","v":"Grad 1-5"},{"$f":"IF(VLOOKUP(J89,'3.INFRASTRUCTURAS Y SERVICIOS'!I:K,3,FALSE)=\"\",\"no_data\",VLOOKUP(J89,'3.INFRASTRUCTURAS Y SERVICIOS'!I:K,3,FALSE))","v":"no_data"},0,5,0,0,2,0,10,0,{"$f":"ListaCriterios!O89","v":0}]
[{"$f":"ListaCriterios!A90","v":3},{"$f":"ListaCriterios!B90","v":"Infrastructuras y servicios"},{"$f":"ListaCriterios!C90","v":"3.2"},{"$f":"ListaCriterios!D90","v":"Infrastructuras básicas"},{"$f":"ListaCriterios!E90","v":"3.2.1"},{"$f":"ListaCriterios!F90","v":"Abastecimiento de agua"},{"$f":"ListaCriterios!G90","v":"AGUA"},{"$f":"ListaCriterios!H90","v":"3.2.01.p"},{"$f":"ListaCriterios!I90","v":0},{"$f":"ListaCriterios!J90","v":"¿La red de abastecimiento de agua es adecuada al tipo de área empresarial?"},{"$f":"ListaCriterios!K90","v":"SI/NO"},{"$f":"IF(VLOOKUP(J90,'3.INFRASTRUCTURAS Y SERVICIOS'!I:K,3,FALSE)=\"\",\"no_data\",VLOOKUP(J90,'3.INFRASTRUCTURAS Y SERVICIOS'!I:K,3,FALSE))","v":"no_data"},0,5,0,0,2,0,10,0,{"$f":"ListaCriterios!O90","v":0}]
[{"$f":"ListaCriterios!A91","v":3},{"$f":"ListaCriterios!B91","v":"Infrastructuras y servicios"},{"$f":"ListaCriterios!C91","v":"3.2"},{"$f":"ListaCriterios!D91","v":"Infrastructuras básicas"},{"$f":"ListaCriterios!E91","v":"3.2.1"},{"$f":"ListaCriterios!F91","v":"Abastecimiento de agua"},{"$f":"ListaCriterios!G91","v":"AGUA"},{"$f":"ListaCriterios!H91","v":"3.2.01.q"},{"$f":"ListaCriterios!I91","v":0},{"$f":"ListaCriterios!J91","v":"¿La red de abastecimiento está completamente en servicio?"},{"$f":"ListaCriterios!K91","v":"SI/NO"},{"$f":"IF(VLOOKUP(J91,'3.INFRASTRUCTURAS Y SERVICIOS'!I:K,3,FALSE)=\"\",\"no_data\",VLOOKUP(J91,'3.INFRASTRUCTURAS Y SERVICIOS'!I:K,3,FALSE))","v":"no_data"},0,5,0,0,2,0,10,0,{"$f":"ListaCriterios!O91","v":0}]
[{"$f":"ListaCriterios!A92","v":3},{"$f":"ListaCriterios!B92","v":"Infrastructuras y servicios"},{"$f":"ListaCriterios!C92","v":"3.2"},{"$f":"ListaCriterios!D92","v":"Infrastructuras básicas"},{"$f":"ListaCriterios!E92","v":"3.2.2"},{"$f":"ListaCriterios!F92","v":"Saneamiento de agua"},{"$f":"ListaCriterios!G92","v":"AGUA"},{"$f":"ListaCriterios!H92","v":"3.2.02.a"},{"$f":"ListaCriterios!I92","v":0},{"$f":"ListaCriterios!J92","v":"¿Se dispone de plano de la red de saneamiento?"},{"$f":"ListaCriterios!K92","v":"SI/NO"},{"$f":"IF(VLOOKUP(J92,'3.INFRASTRUCTURAS Y SERVICIOS'!I:K,3,FALSE)=\"\",\"no_data\",VLOOKUP(J92,'3.INFRASTRUCTURAS Y SERVICIOS'!I:K,3,FALSE))","v":"no_data"},0,5,0,0,2,0,10,0,{"$f":"ListaCriterios!O92","v":0}]
[{"$f":"ListaCriterios!A93","v":3},{"$f":"ListaCriterios!B93","v":"Infrastructuras y servicios"},{"$f":"ListaCriterios!C93","v":"3.2"},{"$f":"ListaCriterios!D93","v":"Infrastructuras básicas"},{"$f":"ListaCriterios!E93","v":"3.2.2"},{"$f":"ListaCriterios!F93","v":"Saneamiento de agua"},{"$f":"ListaCriterios!G93","v":"AGUA"},{"$f":"ListaCriterios!H93","v":"3.2.02.b"},{"$f":"ListaCriterios!I93","v":0},{"$f":"ListaCriterios!J93","v":"¿La red de saneamiento es adecuada al tipo de área empresarial?"},{"$f":"ListaCriterios!K93","v":"SI/NO"},{"$f":"IF(VLOOKUP(J93,'3.INFRASTRUCTURAS Y SERVICIOS'!I:K,3,FALSE)=\"\",\"no_data\",VLOOKUP(J93,'3.INFRASTRUCTURAS Y SERVICIOS'!I:K,3,FALSE))","v":"no_data"},0,5,0,0,2,0,10,0,{"$f":"ListaCriterios!O93","v":0}]
[{"$f":"ListaCriterios!A94","v":3},{"$f":"ListaCriterios!B94","v":"Infrastructuras y servicios"},{"$f":"ListaCriterios!C94","v":"3.2"},{"$f":"ListaCriterios!D94","v":"Infrastructuras básicas"},{"$f":"ListaCriterios!E94","v":"3.2.2"},{"$f":"ListaCriterios!F94","v":"Saneamiento de agua"},{"$f":"ListaCriterios!G94","v":"AGUA"},{"$f":"ListaCriterios!H94","v":"3.2.02.c"},{"$f":"ListaCriterios!I94","v":0},{"$f":"ListaCriterios!J94","v":"¿La red de saneamiento está completamente en servicio?"},{"$f":"ListaCriterios!K94","v":"SI/NO"},{"$f":"IF(VLOOKUP(J94,'3.INFRASTRUCTURAS Y SERVICIOS'!I:K,3,FALSE)=\"\",\"no_data\",VLOOKUP(J94,'3.INFRASTRUCTURAS Y SERVICIOS'!I:K,3,FALSE))","v":"no_data"},0,5,0,0,2,0,10,0,{"$f":"ListaCriterios!O94","v":0}]
[{"$f":"ListaCriterios!A95","v":3},{"$f":"ListaCriterios!B95","v":"Infrastructuras y servicios"},{"$f":"ListaCriterios!C95","v":"3.2"},{"$f":"ListaCriterios!D95","v":"Infrastructuras básicas"},{"$f":"ListaCriterios!E95","v":"3.2.2"},{"$f":"ListaCriterios!F95","v":"Saneamiento de agua"},{"$f":"ListaCriterios!G95","v":"AGUA"},{"$f":"ListaCriterios!H95","v":"3.2.02.d"},{"$f":"ListaCriterios!I95","v":0},{"$f":"ListaCriterios!J95","v":"¿La red de saneamiento del PAE desagua en depuradora, del PAE o externa?"},{"$f":"ListaCriterios!K95","v":"SI/NO"},{"$f":"IF(VLOOKUP(J95,'3.INFRASTRUCTURAS Y SERVICIOS'!I:K,3,FALSE)=\"\",\"no_data\",VLOOKUP(J95,'3.INFRASTRUCTURAS Y SERVICIOS'!I:K,3,FALSE))","v":"no_data"},0,5,0,0,2,0,10,0,{"$f":"ListaCriterios!O95","v":0}]
[{"$f":"ListaCriterios!A96","v":3},{"$f":"ListaCriterios!B96","v":"Infrastructuras y servicios"},{"$f":"ListaCriterios!C96","v":"3.2"},{"$f":"ListaCriterios!D96","v":"Infrastructuras básicas"},{"$f":"ListaCriterios!E96","v":"3.2.2"},{"$f":"ListaCriterios!F96","v":"Saneamiento de agua"},{"$f":"ListaCriterios!G96","v":"AGUA"},{"$f":"ListaCriterios!H96","v":"3.2.02.e"},{"$f":"ListaCriterios!I96","v":"x"},{"$f":"ListaCriterios!J96","v":"¿Existe algún tipo de red de agua regenerada?"},{"$f":"ListaCriterios!K96","v":"SI/NO"},{"$f":"IF(VLOOKUP(J96,'3.INFRASTRUCTURAS Y SERVICIOS'!I:K,3,FALSE)=\"\",\"no_data\",VLOOKUP(J96,'3.INFRASTRUCTURAS Y SERVICIOS'!I:K,3,FALSE))","v":"no_data"},0,5,0,0,3,0,15,0,{"$f":"ListaCriterios!O96","v":"Proyectar y ejecutar una red de tratamiento y regeneración de agua"}]
[{"$f":"ListaCriterios!A97","v":3},{"$f":"ListaCriterios!B97","v":"Infrastructuras y servicios"},{"$f":"ListaCriterios!C97","v":"3.2"},{"$f":"ListaCriterios!D97","v":"Infrastructuras básicas"},{"$f":"ListaCriterios!E97","v":"3.2.2"},{"$f":"ListaCriterios!F97","v":"Saneamiento de agua"},{"$f":"ListaCriterios!G97","v":"AGUA"},{"$f":"ListaCriterios!H97","v":"3.2.02.e"},{"$f":"ListaCriterios!I97","v":0},{"$f":"ListaCriterios!J97","v":"La capacidad de depuración es adecuada a la tipología y volumen de empresas del área"},{"$f":"ListaCriterios!K97","v":"SI/NO"},{"$f":"IF(VLOOKUP(J97,'3.INFRASTRUCTURAS Y SERVICIOS'!I:K,3,FALSE)=\"\",\"no_data\",VLOOKUP(J97,'3.INFRASTRUCTURAS Y SERVICIOS'!I:K,3,FALSE))","v":"no_data"},0,5,0,0,2,0,10,0,{"$f":"ListaCriterios!O97","v":"Disponer de un sistema de depuración de agua adecuado a la tipología y volumen de empresas del PAE"}]
[{"$f":"ListaCriterios!A98","v":3},{"$f":"ListaCriterios!B98","v":"Infrastructuras y servicios"},{"$f":"ListaCriterios!C98","v":"3.2"},{"$f":"ListaCriterios!D98","v":"Infrastructuras básicas"},{"$f":"ListaCriterios!E98","v":"3.2.2"},{"$f":"ListaCriterios!F98","v":"Saneamiento de agua"},{"$f":"ListaCriterios!G98","v":"AGUA"},{"$f":"ListaCriterios!H98","v":"3.2.02.f"},{"$f":"ListaCriterios!I98","v":0},{"$f":"ListaCriterios!J98","v":"Proporción de empresas que tienen acceso a EDAR"},{"$f":"ListaCriterios!K98","v":"Grad 1-5"},{"$f":"IF(VLOOKUP(J98,'3.INFRASTRUCTURAS Y SERVICIOS'!I:K,3,FALSE)=\"\",\"no_data\",VLOOKUP(J98,'3.INFRASTRUCTURAS Y SERVICIOS'!I:K,3,FALSE))","v":"no_data"},0,5,0,0,2,0,10,0,{"$f":"ListaCriterios!O98","v":0}]
[{"$f":"ListaCriterios!A99","v":3},{"$f":"ListaCriterios!B99","v":"Infrastructuras y servicios"},{"$f":"ListaCriterios!C99","v":"3.2"},{"$f":"ListaCriterios!D99","v":"Infrastructuras básicas"},{"$f":"ListaCriterios!E99","v":"3.2.2"},{"$f":"ListaCriterios!F99","v":"Saneamiento de agua"},{"$f":"ListaCriterios!G99","v":"AGUA"},{"$f":"ListaCriterios!H99","v":"3.2.02.g"},{"$f":"ListaCriterios!I99","v":0},{"$f":"ListaCriterios!J99","v":"¿Cuál es el grado de extensión de la red de alcantarillado (grado de acceso de las empresas)?"},{"$f":"ListaCriterios!K99","v":"Grad 1-5"},{"$f":"IF(VLOOKUP(J99,'3.INFRASTRUCTURAS Y SERVICIOS'!I:K,3,FALSE)=\"\",\"no_data\",VLOOKUP(J99,'3.INFRASTRUCTURAS Y SERVICIOS'!I:K,3,FALSE))","v":"no_data"},0,5,0,0,2,0,10,0,{"$f":"ListaCriterios!O99","v":0}]
[{"$f":"ListaCriterios!A100","v":3},{"$f":"ListaCriterios!B100","v":"Infrastructuras y servicios"},{"$f":"ListaCriterios!C100","v":"3.2"},{"$f":"ListaCriterios!D100","v":"Infrastructuras básicas"},{"$f":"ListaCriterios!E100","v":"3.2.2"},{"$f":"ListaCriterios!F100","v":"Saneamiento de agua"},{"$f":"ListaCriterios!G100","v":"AGUA"},{"$f":"ListaCriterios!H100","v":"3.2.02.h"},{"$f":"ListaCriterios!I100","v":0},{"$f":"ListaCriterios!J100","v":"¿Se tiene acceso al contrato de prestación de servicio de red de saneamiento (por ejemplo, adjudicación pública del servicio)?"},{"$f":"ListaCriterios!K100","v":"SI/NO"},{"$f":"IF(VLOOKUP(J100,'3.INFRASTRUCTURAS Y SERVICIOS'!I:K,3,FALSE)=\"\",\"no_data\",VLOOKUP(J100,'3.INFRASTRUCTURAS Y SERVICIOS'!I:K,3,FALSE))","v":"no_data"},0,5,0,0,2,0,10,0,{"$f":"ListaCriterios!O100","v":0}]
[{"$f":"ListaCriterios!A101","v":3},{"$f":"ListaCriterios!B101","v":"Infrastructuras y servicios"},{"$f":"ListaCriterios!C101","v":"3.2"},{"$f":"ListaCriterios!D101","v":"Infrastructuras básicas"},{"$f":"ListaCriterios!E101","v":"3.2.2"},{"$f":"ListaCriterios!F101","v":"Saneamiento de agua"},{"$f":"ListaCriterios!G101","v":"AGUA"},{"$f":"ListaCriterios!H101","v":"3.2.02.i"},{"$f":"ListaCriterios!I101","v":0},{"$f":"ListaCriterios!J101","v":"¿Se tiene acceso a las analíticas periódicas del vertido?"},{"$f":"ListaCriterios!K101","v":"SI/NO"},{"$f":"IF(VLOOKUP(J101,'3.INFRASTRUCTURAS Y SERVICIOS'!I:K,3,FALSE)=\"\",\"no_data\",VLOOKUP(J101,'3.INFRASTRUCTURAS Y SERVICIOS'!I:K,3,FALSE))","v":"no_data"},0,5,0,0,2,0,10,0,{"$f":"ListaCriterios!O101","v":0}]
[{"$f":"ListaCriterios!A102","v":3},{"$f":"ListaCriterios!B102","v":"Infrastructuras y servicios"},{"$f":"ListaCriterios!C102","v":"3.2"},{"$f":"ListaCriterios!D102","v":"Infrastructuras básicas"},{"$f":"ListaCriterios!E102","v":"3.2.2"},{"$f":"ListaCriterios!F102","v":"Saneamiento de agua"},{"$f":"ListaCriterios!G102","v":"AGUA"},{"$f":"ListaCriterios!H102","v":"3.2.02.j"},{"$f":"ListaCriterios!I102","v":0},{"$f":"ListaCriterios!J102","v":"(En caso de ser específica del área) ¿La EDAR funciona correctamente y se mantiene de forma adecuada?"},{"$f":"ListaCriterios!K102","v":"SI/NO"},{"$f":"IF(VLOOKUP(J102,'3.INFRASTRUCTURAS Y SERVICIOS'!I:K,3,FALSE)=\"\",\"no_data\",VLOOKUP(J102,'3.INFRASTRUCTURAS Y SERVICIOS'!I:K,3,FALSE))","v":"no_data"},0,5,0,0,2,0,10,0,{"$f":"ListaCriterios!O102","v":0}]
[{"$f":"ListaCriterios!A103","v":3},{"$f":"ListaCriterios!B103","v":"Infrastructuras y servicios"},{"$f":"ListaCriterios!C103","v":"3.2"},{"$f":"ListaCriterios!D103","v":"Infrastructuras básicas"},{"$f":"ListaCriterios!E103","v":"3.2.2"},{"$f":"ListaCriterios!F103","v":"Saneamiento de agua"},{"$f":"ListaCriterios!G103","v":"AGUA"},{"$f":"ListaCriterios!H103","v":"3.2.02.k"},{"$f":"ListaCriterios!I103","v":0},{"$f":"ListaCriterios!J103","v":"¿Se tienen documentos oficiales que reflejan las principales características de la red de saneamiento (por ejemplo, pliego de condiciones técnicas de prestación de servicio)? ."},{"$f":"ListaCriterios!K103","v":"SI/NO"},{"$f":"IF(VLOOKUP(J103,'3.INFRASTRUCTURAS Y SERVICIOS'!I:K,3,FALSE)=\"\",\"no_data\",VLOOKUP(J103,'3.INFRASTRUCTURAS Y SERVICIOS'!I:K,3,FALSE))","v":"no_data"},0,5,0,0,2,0,10,0,{"$f":"ListaCriterios!O103","v":0}]
[{"$f":"ListaCriterios!A104","v":3},{"$f":"ListaCriterios!B104","v":"Infrastructuras y servicios"},{"$f":"ListaCriterios!C104","v":"3.2"},{"$f":"ListaCriterios!D104","v":"Infrastructuras básicas"},{"$f":"ListaCriterios!E104","v":"3.2.3"},{"$f":"ListaCriterios!F104","v":"Alumbrado público"},{"$f":"ListaCriterios!G104","v":"ENERGÍA Y CAMBIO CLIMATIC"},{"$f":"ListaCriterios!H104","v":"3.2.03.a"},{"$f":"ListaCriterios!I104","v":0},{"$f":"ListaCriterios!J104","v":"Cantidad de lámparas consideradas eficientes energéticamente (%)"},{"$f":"ListaCriterios!K104","v":"Grad 1-5"},{"$f":"IF(VLOOKUP(J104,'3.INFRASTRUCTURAS Y SERVICIOS'!I:K,3,FALSE)=\"\",\"no_data\",VLOOKUP(J104,'3.INFRASTRUCTURAS Y SERVICIOS'!I:K,3,FALSE))","v":"no_data"},0,5,0,0,1,0,5,0,{"$f":"ListaCriterios!O104","v":0}]
[{"$f":"ListaCriterios!A105","v":3},{"$f":"ListaCriterios!B105","v":"Infrastructuras y servicios"},{"$f":"ListaCriterios!C105","v":"3.2"},{"$f":"ListaCriterios!D105","v":"Infrastructuras básicas"},{"$f":"ListaCriterios!E105","v":"3.2.3"},{"$f":"ListaCriterios!F105","v":"Alumbrado público"},{"$f":"ListaCriterios!G105","v":"ENERGÍA Y CAMBIO CLIMATIC"},{"$f":"ListaCriterios!H105","v":"3.2.03.b"},{"$f":"ListaCriterios!I105","v":0},{"$f":"ListaCriterios!J105","v":"Superficie iluminada (%)"},{"$f":"ListaCriterios!K105","v":"Grad 1-5"},{"$f":"IF(VLOOKUP(J105,'3.INFRASTRUCTURAS Y SERVICIOS'!I:K,3,FALSE)=\"\",\"no_data\",VLOOKUP(J105,'3.INFRASTRUCTURAS Y SERVICIOS'!I:K,3,FALSE))","v":"no_data"},0,5,0,0,1,0,5,0,{"$f":"ListaCriterios!O105","v":0}]
[{"$f":"ListaCriterios!A106","v":3},{"$f":"ListaCriterios!B106","v":"Infrastructuras y servicios"},{"$f":"ListaCriterios!C106","v":"3.2"},{"$f":"ListaCriterios!D106","v":"Infrastructuras básicas"},{"$f":"ListaCriterios!E106","v":"3.2.3"},{"$f":"ListaCriterios!F106","v":"Alumbrado público"},{"$f":"ListaCriterios!G106","v":"ENERGÍA Y CAMBIO CLIMATIC"},{"$f":"ListaCriterios!H106","v":"3.2.03.c"},{"$f":"ListaCriterios!I106","v":0},{"$f":"ListaCriterios!J106","v":"¿Se tiene el Contrato de prestación de servicio de alumbrado público (por ejemplo, adjudicación pública del servicio)?"},{"$f":"ListaCriterios!K106","v":"SI/NO"},{"$f":"IF(VLOOKUP(J106,'3.INFRASTRUCTURAS Y SERVICIOS'!I:K,3,FALSE)=\"\",\"no_data\",VLOOKUP(J106,'3.INFRASTRUCTURAS Y SERVICIOS'!I:K,3,FALSE))","v":"no_data"},0,5,0,0,1,0,5,0,{"$f":"ListaCriterios!O106","v":0}]
[{"$f":"ListaCriterios!A107","v":3},{"$f":"ListaCriterios!B107","v":"Infrastructuras y servicios"},{"$f":"ListaCriterios!C107","v":"3.2"},{"$f":"ListaCriterios!D107","v":"Infrastructuras básicas"},{"$f":"ListaCriterios!E107","v":"3.2.3"},{"$f":"ListaCriterios!F107","v":"Alumbrado público"},{"$f":"ListaCriterios!G107","v":"ENERGÍA Y CAMBIO CLIMATIC"},{"$f":"ListaCriterios!H107","v":"3.2.03.d"},{"$f":"ListaCriterios!I107","v":0},{"$f":"ListaCriterios!J107","v":"¿Se dispone de Documentos oficiales que reflejan las principales características de la red de alumbrado publico (por ejemplo pliego condiciones técnicas de prestación de servicio)?"},{"$f":"ListaCriterios!K107","v":"SI/NO"},{"$f":"IF(VLOOKUP(J107,'3.INFRASTRUCTURAS Y SERVICIOS'!I:K,3,FALSE)=\"\",\"no_data\",VLOOKUP(J107,'3.INFRASTRUCTURAS Y SERVICIOS'!I:K,3,FALSE))","v":"no_data"},0,5,0,0,1,0,5,0,{"$f":"ListaCriterios!O107","v":0}]
[{"$f":"ListaCriterios!A108","v":3},{"$f":"ListaCriterios!B108","v":"Infrastructuras y servicios"},{"$f":"ListaCriterios!C108","v":"3.2"},{"$f":"ListaCriterios!D108","v":"Infrastructuras básicas"},{"$f":"ListaCriterios!E108","v":"3.2.3"},{"$f":"ListaCriterios!F108","v":"Alumbrado público"},{"$f":"ListaCriterios!G108","v":"ENERGÍA Y CAMBIO CLIMATIC"},{"$f":"ListaCriterios!H108","v":"3.2.03.e"},{"$f":"ListaCriterios!I108","v":0},{"$f":"ListaCriterios!J108","v":"¿Se dispone de planos de la red de alumbrado?"},{"$f":"ListaCriterios!K108","v":"SI/NO"},{"$f":"IF(VLOOKUP(J108,'3.INFRASTRUCTURAS Y SERVICIOS'!I:K,3,FALSE)=\"\",\"no_data\",VLOOKUP(J108,'3.INFRASTRUCTURAS Y SERVICIOS'!I:K,3,FALSE))","v":"no_data"},0,5,0,0,1,0,5,0,{"$f":"ListaCriterios!O108","v":0}]
[{"$f":"ListaCriterios!A109","v":3},{"$f":"ListaCriterios!B109","v":"Infrastructuras y servicios"},{"$f":"ListaCriterios!C109","v":"3.2"},{"$f":"ListaCriterios!D109","v":"Infrastructuras básicas"},{"$f":"ListaCriterios!E109","v":"3.2.3"},{"$f":"ListaCriterios!F109","v":"Alumbrado público"},{"$f":"ListaCriterios!G109","v":"ENERGÍA Y CAMBIO CLIMATIC"},{"$f":"ListaCriterios!H109","v":"3.2.03.f"},{"$f":"ListaCriterios!I109","v":0},{"$f":"ListaCriterios!J109","v":"Estado de conservación es adecuado, sin cableado al aire en cajas de conexiones y cuadros eléctricos públicos"},{"$f":"ListaCriterios!K109","v":"Grad 1-5"},{"$f":"IF(VLOOKUP(J109,'3.INFRASTRUCTURAS Y SERVICIOS'!I:K,3,FALSE)=\"\",\"no_data\",VLOOKUP(J109,'3.INFRASTRUCTURAS Y SERVICIOS'!I:K,3,FALSE))","v":"no_data"},0,5,0,0,1,0,5,0,{"$f":"ListaCriterios!O109","v":0}]
[{"$f":"ListaCriterios!A110","v":3},{"$f":"ListaCriterios!B110","v":"Infrastructuras y servicios"},{"$f":"ListaCriterios!C110","v":"3.2"},{"$f":"ListaCriterios!D110","v":"Infrastructuras básicas"},{"$f":"ListaCriterios!E110","v":"3.2.3"},{"$f":"ListaCriterios!F110","v":"Alumbrado público"},{"$f":"ListaCriterios!G110","v":"ENERGÍA Y CAMBIO CLIMATIC"},{"$f":"ListaCriterios!H110","v":"3.2.03.g"},{"$f":"ListaCriterios!I110","v":0},{"$f":"ListaCriterios!J110","v":"De ser requerido, hay elementos de alumbrado en zonas que requieren de visibilidad (paradas de transporte público...)"},{"$f":"ListaCriterios!K110","v":"SI/NO"},{"$f":"IF(VLOOKUP(J110,'3.INFRASTRUCTURAS Y SERVICIOS'!I:K,3,FALSE)=\"\",\"no_data\",VLOOKUP(J110,'3.INFRASTRUCTURAS Y SERVICIOS'!I:K,3,FALSE))","v":"no_data"},0,5,0,0,1,0,5,0,{"$f":"ListaCriterios!O110","v":0}]
[{"$f":"ListaCriterios!A111","v":3},{"$f":"ListaCriterios!B111","v":"Infrastructuras y servicios"},{"$f":"ListaCriterios!C111","v":"3.2"},{"$f":"ListaCriterios!D111","v":"Infrastructuras básicas"},{"$f":"ListaCriterios!E111","v":"3.2.3"},{"$f":"ListaCriterios!F111","v":"Alumbrado público"},{"$f":"ListaCriterios!G111","v":"ENERGÍA Y CAMBIO CLIMATIC"},{"$f":"ListaCriterios!H111","v":"3.2.03.h"},{"$f":"ListaCriterios!I111","v":0},{"$f":"ListaCriterios!J111","v":"¿Existe un protocolo definido con el titular de la infraestructura y éste se cumple?"},{"$f":"ListaCriterios!K111","v":"SI/NO"},{"$f":"IF(VLOOKUP(J111,'3.INFRASTRUCTURAS Y SERVICIOS'!I:K,3,FALSE)=\"\",\"no_data\",VLOOKUP(J111,'3.INFRASTRUCTURAS Y SERVICIOS'!I:K,3,FALSE))","v":"no_data"},0,5,0,0,1,0,5,0,{"$f":"ListaCriterios!O111","v":0}]
[{"$f":"ListaCriterios!A112","v":3},{"$f":"ListaCriterios!B112","v":"Infrastructuras y servicios"},{"$f":"ListaCriterios!C112","v":"3.2"},{"$f":"ListaCriterios!D112","v":"Infrastructuras básicas"},{"$f":"ListaCriterios!E112","v":"3.2.3"},{"$f":"ListaCriterios!F112","v":"Alumbrado público"},{"$f":"ListaCriterios!G112","v":"ENERGÍA Y CAMBIO CLIMATIC"},{"$f":"ListaCriterios!H112","v":"3.2.03.i"},{"$f":"ListaCriterios!I112","v":0},{"$f":"ListaCriterios!J112","v":"¿Está garantizada la adecuada visibilidad durante el horario de actividad habitual, de acuerdo con las circunstancias del entorno?"},{"$f":"ListaCriterios!K112","v":"SI/NO"},{"$f":"IF(VLOOKUP(J112,'3.INFRASTRUCTURAS Y SERVICIOS'!I:K,3,FALSE)=\"\",\"no_data\",VLOOKUP(J112,'3.INFRASTRUCTURAS Y SERVICIOS'!I:K,3,FALSE))","v":"no_data"},0,5,0,0,1,0,5,0,{"$f":"ListaCriterios!O112","v":0}]
[{"$f":"ListaCriterios!A113","v":3},{"$f":"ListaCriterios!B113","v":"Infrastructuras y servicios"},{"$f":"ListaCriterios!C113","v":"3.2"},{"$f":"ListaCriterios!D113","v":"Infrastructuras básicas"},{"$f":"ListaCriterios!E113","v":"3.2.4"},{"$f":"ListaCriterios!F113","v":"Red eléctrica"},{"$f":"ListaCriterios!G113","v":"ENERGÍA Y CAMBIO CLIMATIC"},{"$f":"ListaCriterios!H113","v":"3.2.04.a"},{"$f":"ListaCriterios!I113","v":0},{"$f":"ListaCriterios!J113","v":"¿Se dispone de Documentos oficiales que reflejan las principales características de la red/s de suministro energético (por ejemplo pliego condiciones técnicas de prestación de servicio)?"},{"$f":"ListaCriterios!K113","v":"SI/NO"},{"$f":"IF(VLOOKUP(J113,'3.INFRASTRUCTURAS Y SERVICIOS'!I:K,3,FALSE)=\"\",\"no_data\",VLOOKUP(J113,'3.INFRASTRUCTURAS Y SERVICIOS'!I:K,3,FALSE))","v":"no_data"},0,5,0,0,1,0,5,0,{"$f":"ListaCriterios!O113","v":0}]
[{"$f":"ListaCriterios!A114","v":3},{"$f":"ListaCriterios!B114","v":"Infrastructuras y servicios"},{"$f":"ListaCriterios!C114","v":"3.2"},{"$f":"ListaCriterios!D114","v":"Infrastructuras básicas"},{"$f":"ListaCriterios!E114","v":"3.2.4"},{"$f":"ListaCriterios!F114","v":"Red eléctrica"},{"$f":"ListaCriterios!G114","v":"ENERGÍA Y CAMBIO CLIMATIC"},{"$f":"ListaCriterios!H114","v":"3.2.04.b"},{"$f":"ListaCriterios!I114","v":0},{"$f":"ListaCriterios!J114","v":"¿Se dispone de Plano de las redes para el suministro energético?"},{"$f":"ListaCriterios!K114","v":"SI/NO"},{"$f":"IF(VLOOKUP(J114,'3.INFRASTRUCTURAS Y SERVICIOS'!I:K,3,FALSE)=\"\",\"no_data\",VLOOKUP(J114,'3.INFRASTRUCTURAS Y SERVICIOS'!I:K,3,FALSE))","v":"no_data"},0,5,0,0,1,0,5,0,{"$f":"ListaCriterios!O114","v":0}]
[{"$f":"ListaCriterios!A115","v":3},{"$f":"ListaCriterios!B115","v":"Infrastructuras y servicios"},{"$f":"ListaCriterios!C115","v":"3.2"},{"$f":"ListaCriterios!D115","v":"Infrastructuras básicas"},{"$f":"ListaCriterios!E115","v":"3.2.4"},{"$f":"ListaCriterios!F115","v":"Red eléctrica"},{"$f":"ListaCriterios!G115","v":"ENERGÍA Y CAMBIO CLIMATIC"},{"$f":"ListaCriterios!H115","v":"3.2.04.c"},{"$f":"ListaCriterios!I115","v":0},{"$f":"ListaCriterios!J115","v":"¿Se tiene el contrato/s de prestación de servicio de mantenimiento suministro energético (por ejemplo, adjudicación pública del servicio)?"},{"$f":"ListaCriterios!K115","v":"SI/NO"},{"$f":"IF(VLOOKUP(J115,'3.INFRASTRUCTURAS Y SERVICIOS'!I:K,3,FALSE)=\"\",\"no_data\",VLOOKUP(J115,'3.INFRASTRUCTURAS Y SERVICIOS'!I:K,3,FALSE))","v":"no_data"},0,5,0,0,1,0,5,0,{"$f":"ListaCriterios!O115","v":0}]
[{"$f":"ListaCriterios!A116","v":3},{"$f":"ListaCriterios!B116","v":"Infrastructuras y servicios"},{"$f":"ListaCriterios!C116","v":"3.2"},{"$f":"ListaCriterios!D116","v":"Infrastructuras básicas"},{"$f":"ListaCriterios!E116","v":"3.2.4"},{"$f":"ListaCriterios!F116","v":"Red eléctrica"},{"$f":"ListaCriterios!G116","v":"ENERGÍA Y CAMBIO CLIMATIC"},{"$f":"ListaCriterios!H116","v":"3.2.04.d"},{"$f":"ListaCriterios!I116","v":0},{"$f":"ListaCriterios!J116","v":"Estado de conservación de la red / redes de suministro energético"},{"$f":"ListaCriterios!K116","v":"Grad 1-5"},{"$f":"IF(VLOOKUP(J116,'3.INFRASTRUCTURAS Y SERVICIOS'!I:K,3,FALSE)=\"\",\"no_data\",VLOOKUP(J116,'3.INFRASTRUCTURAS Y SERVICIOS'!I:K,3,FALSE))","v":"no_data"},0,5,0,0,1,0,5,0,{"$f":"ListaCriterios!O116","v":0}]
[{"$f":"ListaCriterios!A117","v":3},{"$f":"ListaCriterios!B117","v":"Infrastructuras y servicios"},{"$f":"ListaCriterios!C117","v":"3.2"},{"$f":"ListaCriterios!D117","v":"Infrastructuras básicas"},{"$f":"ListaCriterios!E117","v":"3.2.4"},{"$f":"ListaCriterios!F117","v":"Red eléctrica"},{"$f":"ListaCriterios!G117","v":"ENERGÍA Y CAMBIO CLIMATIC"},{"$f":"ListaCriterios!H117","v":"3.2.04.e"},{"$f":"ListaCriterios!I117","v":0},{"$f":"ListaCriterios!J117","v":"¿Se considera que la red/s de suministro energético adecuadamente dimensionadas y capaces de suministrar suficiente energía a todas las parcelas?"},{"$f":"ListaCriterios!K117","v":"SI/NO"},{"$f":"IF(VLOOKUP(J117,'3.INFRASTRUCTURAS Y SERVICIOS'!I:K,3,FALSE)=\"\",\"no_data\",VLOOKUP(J117,'3.INFRASTRUCTURAS Y SERVICIOS'!I:K,3,FALSE))","v":"no_data"},0,5,0,0,1,0,5,0,{"$f":"ListaCriterios!O117","v":0}]
[{"$f":"ListaCriterios!A118","v":3},{"$f":"ListaCriterios!B118","v":"Infrastructuras y servicios"},{"$f":"ListaCriterios!C118","v":"3.2"},{"$f":"ListaCriterios!D118","v":"Infrastructuras básicas"},{"$f":"ListaCriterios!E118","v":"3.2.5"},{"$f":"ListaCriterios!F118","v":"Infraestructuras viarias"},{"$f":"ListaCriterios!G118","v":"MOVILIDAD"},{"$f":"ListaCriterios!H118","v":"3.2.05.a"},{"$f":"ListaCriterios!I118","v":0},{"$f":"ListaCriterios!J118","v":"Cercanía a red primaria de carreteras"},{"$f":"ListaCriterios!K118","v":"Grad 1-5"},{"$f":"IF(VLOOKUP(J118,'3.INFRASTRUCTURAS Y SERVICIOS'!I:K,3,FALSE)=\"\",\"no_data\",VLOOKUP(J118,'3.INFRASTRUCTURAS Y SERVICIOS'!I:K,3,FALSE))","v":"no_data"},0,5,0,0,1,0,5,0,{"$f":"ListaCriterios!O118","v":0}]
[{"$f":"ListaCriterios!A119","v":3},{"$f":"ListaCriterios!B119","v":"Infrastructuras y servicios"},{"$f":"ListaCriterios!C119","v":"3.2"},{"$f":"ListaCriterios!D119","v":"Infrastructuras básicas"},{"$f":"ListaCriterios!E119","v":"3.2.5"},{"$f":"ListaCriterios!F119","v":"Infraestructuras viarias"},{"$f":"ListaCriterios!G119","v":"MOVILIDAD"},{"$f":"ListaCriterios!H119","v":"3.2.05.b"},{"$f":"ListaCriterios!I119","v":0},{"$f":"ListaCriterios!J119","v":"Existen elementos de pacificación (separadores, carriles, reductores de velocidad) en zonas de tráfico rápido y/o paso de personas"},{"$f":"ListaCriterios!K119","v":"SI/NO"},{"$f":"IF(VLOOKUP(J119,'3.INFRASTRUCTURAS Y SERVICIOS'!I:K,3,FALSE)=\"\",\"no_data\",VLOOKUP(J119,'3.INFRASTRUCTURAS Y SERVICIOS'!I:K,3,FALSE))","v":"no_data"},0,5,0,0,1,0,5,0,{"$f":"ListaCriterios!O119","v":0}]
[{"$f":"ListaCriterios!A120","v":3},{"$f":"ListaCriterios!B120","v":"Infrastructuras y servicios"},{"$f":"ListaCriterios!C120","v":"3.2"},{"$f":"ListaCriterios!D120","v":"Infrastructuras básicas"},{"$f":"ListaCriterios!E120","v":"3.2.5"},{"$f":"ListaCriterios!F120","v":"Infraestructuras viarias"},{"$f":"ListaCriterios!G120","v":"MOVILIDAD"},{"$f":"ListaCriterios!H120","v":"3.2.05.c"},{"$f":"ListaCriterios!I120","v":"x"},{"$f":"ListaCriterios!J120","v":"¿La red viaria al polígono está construida con materiales de alto índice de sostenibilidad?"},{"$f":"ListaCriterios!K120","v":"SI/NO"},{"$f":"IF(VLOOKUP(J120,'3.INFRASTRUCTURAS Y SERVICIOS'!I:K,3,FALSE)=\"\",\"no_data\",VLOOKUP(J120,'3.INFRASTRUCTURAS Y SERVICIOS'!I:K,3,FALSE))","v":"no_data"},0,5,0,0,3,0,15,0,{"$f":"ListaCriterios!O120","v":"Nuevos carreras y carreteras y reparaciones con materiales con etiqueta y certificaciones de sostenibilidad"}]
[{"$f":"ListaCriterios!A121","v":3},{"$f":"ListaCriterios!B121","v":"Infrastructuras y servicios"},{"$f":"ListaCriterios!C121","v":"3.2"},{"$f":"ListaCriterios!D121","v":"Infrastructuras básicas"},{"$f":"ListaCriterios!E121","v":"3.2.6"},{"$f":"ListaCriterios!F121","v":"Servicios para la movilidad sostenible"},{"$f":"ListaCriterios!G121","v":"MOVILIDAD"},{"$f":"ListaCriterios!H121","v":"3.2.06.a"},{"$f":"ListaCriterios!I121","v":0},{"$f":"ListaCriterios!J121","v":"¿Existen informes o propuestas para la mejora de la movilidad y/o la intermodalidad en el área? (Plan de movilidad específico o equivalente)"},{"$f":"ListaCriterios!K121","v":"SI/NO"},{"$f":"IF(VLOOKUP(J121,'3.INFRASTRUCTURAS Y SERVICIOS'!I:K,3,FALSE)=\"\",\"no_data\",VLOOKUP(J121,'3.INFRASTRUCTURAS Y SERVICIOS'!I:K,3,FALSE))","v":"no_data"},0,5,0,0,2,0,10,0,{"$f":"ListaCriterios!O121","v":0}]
[{"$f":"ListaCriterios!A122","v":3},{"$f":"ListaCriterios!B122","v":"Infrastructuras y servicios"},{"$f":"ListaCriterios!C122","v":"3.2"},{"$f":"ListaCriterios!D122","v":"Infrastructuras básicas"},{"$f":"ListaCriterios!E122","v":"3.2.6"},{"$f":"ListaCriterios!F122","v":"Servicios para la movilidad sostenible"},{"$f":"ListaCriterios!G122","v":"MOVILIDAD"},{"$f":"ListaCriterios!H122","v":"3.2.06.b"},{"$f":"ListaCriterios!I122","v":"x"},{"$f":"ListaCriterios!J122","v":"¿Se dispone de espacios de aparcamiento para vehículos de transporte de mercancías accesibles, claramente delimitados y señalizados?"},{"$f":"ListaCriterios!K122","v":"SI/NO"},{"$f":"IF(VLOOKUP(J122,'3.INFRASTRUCTURAS Y SERVICIOS'!I:K,3,FALSE)=\"\",\"no_data\",VLOOKUP(J122,'3.INFRASTRUCTURAS Y SERVICIOS'!I:K,3,FALSE))","v":"no_data"},0,5,0,0,3,0,15,0,{"$f":"ListaCriterios!O122","v":"Disponer de espacios reservados para el aparcamiento de camiones"}]
[{"$f":"ListaCriterios!A123","v":3},{"$f":"ListaCriterios!B123","v":"Infrastructuras y servicios"},{"$f":"ListaCriterios!C123","v":"3.2"},{"$f":"ListaCriterios!D123","v":"Infrastructuras básicas"},{"$f":"ListaCriterios!E123","v":"3.2.6"},{"$f":"ListaCriterios!F123","v":"Servicios para la movilidad sostenible"},{"$f":"ListaCriterios!G123","v":"MOVILIDAD"},{"$f":"ListaCriterios!H123","v":"3.2.06.c"},{"$f":"ListaCriterios!I123","v":"x"},{"$f":"ListaCriterios!J123","v":"¿Existen políticas de aparcamiento para favorecer la movilidad sostenible?"},{"$f":"ListaCriterios!K123","v":"SI/NO"},{"$f":"IF(VLOOKUP(J123,'3.INFRASTRUCTURAS Y SERVICIOS'!I:K,3,FALSE)=\"\",\"no_data\",VLOOKUP(J123,'3.INFRASTRUCTURAS Y SERVICIOS'!I:K,3,FALSE))","v":"no_data"},0,5,0,0,3,0,15,0,{"$f":"ListaCriterios!O123","v":"Definir políticas de aparcamiento de vehículos que fomenten la movilidad sostenible dentro del PAE y para acceder a ellas desde las zonas más urbanas"}]
[{"$f":"ListaCriterios!A124","v":3},{"$f":"ListaCriterios!B124","v":"Infrastructuras y servicios"},{"$f":"ListaCriterios!C124","v":"3.2"},{"$f":"ListaCriterios!D124","v":"Infrastructuras básicas"},{"$f":"ListaCriterios!E124","v":"3.2.7"},{"$f":"ListaCriterios!F124","v":"Transporte público"},{"$f":"ListaCriterios!G124","v":"MOVILIDAD"},{"$f":"ListaCriterios!H124","v":"3.2.07.a"},{"$f":"ListaCriterios!I124","v":0},{"$f":"ListaCriterios!J124","v":"¿Se dispone de información disponible sobre el transporte público (líneas, recorridos, frecuencias...)?"},{"$f":"ListaCriterios!K124","v":"SI/NO"},{"$f":"IF(VLOOKUP(J124,'3.INFRASTRUCTURAS Y SERVICIOS'!I:K,3,FALSE)=\"\",\"no_data\",VLOOKUP(J124,'3.INFRASTRUCTURAS Y SERVICIOS'!I:K,3,FALSE))","v":"no_data"},0,5,0,0,2,0,10,0,{"$f":"ListaCriterios!O124","v":0}]
[{"$f":"ListaCriterios!A125","v":3},{"$f":"ListaCriterios!B125","v":"Infrastructuras y servicios"},{"$f":"ListaCriterios!C125","v":"3.2"},{"$f":"ListaCriterios!D125","v":"Infrastructuras básicas"},{"$f":"ListaCriterios!E125","v":"3.2.7"},{"$f":"ListaCriterios!F125","v":"Transporte público"},{"$f":"ListaCriterios!G125","v":"MOVILIDAD"},{"$f":"ListaCriterios!H125","v":"3.2.07.b"},{"$f":"ListaCriterios!I125","v":0},{"$f":"ListaCriterios!J125","v":"Proximidad, accesibilidad y estado de conservación de paradas de transporte público"},{"$f":"ListaCriterios!K125","v":"Grad 1-5"},{"$f":"IF(VLOOKUP(J125,'3.INFRASTRUCTURAS Y SERVICIOS'!I:K,3,FALSE)=\"\",\"no_data\",VLOOKUP(J125,'3.INFRASTRUCTURAS Y SERVICIOS'!I:K,3,FALSE))","v":"no_data"},0,5,0,0,2,0,10,0,{"$f":"ListaCriterios!O125","v":0}]
[{"$f":"ListaCriterios!A126","v":3},{"$f":"ListaCriterios!B126","v":"Infrastructuras y servicios"},{"$f":"ListaCriterios!C126","v":"3.2"},{"$f":"ListaCriterios!D126","v":"Infrastructuras básicas"},{"$f":"ListaCriterios!E126","v":"3.2.8"},{"$f":"ListaCriterios!F126","v":"Recorridos a pie o bicicleta"},{"$f":"ListaCriterios!G126","v":"MOVILIDAD"},{"$f":"ListaCriterios!H126","v":"3.2.08.a"},{"$f":"ListaCriterios!I126","v":"x"},{"$f":"ListaCriterios!J126","v":"Adecuación de recorridos a pie o bicicleta"},{"$f":"ListaCriterios!K126","v":"Grad 1-5"},{"$f":"IF(VLOOKUP(J126,'3.INFRASTRUCTURAS Y SERVICIOS'!I:K,3,FALSE)=\"\",\"no_data\",VLOOKUP(J126,'3.INFRASTRUCTURAS Y SERVICIOS'!I:K,3,FALSE))","v":"no_data"},0,5,0,0,3,0,15,0,{"$f":"ListaCriterios!O126","v":"Adecuar recorridos seguros y agradables para fomentar el acceso a pie, bicicleta o similar"}]
[{"$f":"ListaCriterios!A127","v":3},{"$f":"ListaCriterios!B127","v":"Infrastructuras y servicios"},{"$f":"ListaCriterios!C127","v":"3.2"},{"$f":"ListaCriterios!D127","v":"Infrastructuras básicas"},{"$f":"ListaCriterios!E127","v":"3.2.9"},{"$f":"ListaCriterios!F127","v":"Zonas verdes y espacios de ocio"},{"$f":"ListaCriterios!G127","v":"CALIDAD DEL ESPACIO"},{"$f":"ListaCriterios!H127","v":"3.2.09.a"},{"$f":"ListaCriterios!I127","v":0},{"$f":"ListaCriterios!J127","v":"¿Se tiene Contrato de prestación de servicio de jardinería y zonas verdes y de ocio (por ejemplo, adjudicación pública del servicio)?"},{"$f":"ListaCriterios!K127","v":"SI/NO"},{"$f":"IF(VLOOKUP(J127,'3.INFRASTRUCTURAS Y SERVICIOS'!I:K,3,FALSE)=\"\",\"no_data\",VLOOKUP(J127,'3.INFRASTRUCTURAS Y SERVICIOS'!I:K,3,FALSE))","v":"no_data"},0,5,0,0,1,0,5,0,{"$f":"ListaCriterios!O127","v":0}]
[{"$f":"ListaCriterios!A128","v":3},{"$f":"ListaCriterios!B128","v":"Infrastructuras y servicios"},{"$f":"ListaCriterios!C128","v":"3.2"},{"$f":"ListaCriterios!D128","v":"Infrastructuras básicas"},{"$f":"ListaCriterios!E128","v":"3.2.9"},{"$f":"ListaCriterios!F128","v":"Zonas verdes y espacios de ocio"},{"$f":"ListaCriterios!G128","v":"CALIDAD DEL ESPACIO"},{"$f":"ListaCriterios!H128","v":"3.2.09.b"},{"$f":"ListaCriterios!I128","v":0},{"$f":"ListaCriterios!J128","v":"¿Se tienen documentos oficiales que reflejan las principales características de zonas verdes y de ocio (por ejemplo pliego condiciones técnicas de prestación de servicio)?"},{"$f":"ListaCriterios!K128","v":"SI/NO"},{"$f":"IF(VLOOKUP(J128,'3.INFRASTRUCTURAS Y SERVICIOS'!I:K,3,FALSE)=\"\",\"no_data\",VLOOKUP(J128,'3.INFRASTRUCTURAS Y SERVICIOS'!I:K,3,FALSE))","v":"no_data"},0,5,0,0,1,0,5,0,{"$f":"ListaCriterios!O128","v":0}]
[{"$f":"ListaCriterios!A129","v":3},{"$f":"ListaCriterios!B129","v":"Infrastructuras y servicios"},{"$f":"ListaCriterios!C129","v":"3.2"},{"$f":"ListaCriterios!D129","v":"Infrastructuras básicas"},{"$f":"ListaCriterios!E129","v":"3.2.9"},{"$f":"ListaCriterios!F129","v":"Zonas verdes y espacios de ocio"},{"$f":"ListaCriterios!G129","v":"CALIDAD DEL ESPACIO"},{"$f":"ListaCriterios!H129","v":"3.2.09.c"},{"$f":"ListaCriterios!I129","v":0},{"$f":"ListaCriterios!J129","v":"Accesibilidad de zonas verdes y espacios de ocio, sin barreras arquitectónicas y acceso en condiciones de seguridad"},{"$f":"ListaCriterios!K129","v":"SI/NO"},{"$f":"IF(VLOOKUP(J129,'3.INFRASTRUCTURAS Y SERVICIOS'!I:K,3,FALSE)=\"\",\"no_data\",VLOOKUP(J129,'3.INFRASTRUCTURAS Y SERVICIOS'!I:K,3,FALSE))","v":"no_data"},0,5,0,0,1,0,5,0,{"$f":"ListaCriterios!O129","v":0}]
[{"$f":"ListaCriterios!A130","v":3},{"$f":"ListaCriterios!B130","v":"Infrastructuras y servicios"},{"$f":"ListaCriterios!C130","v":"3.2"},{"$f":"ListaCriterios!D130","v":"Infrastructuras básicas"},{"$f":"ListaCriterios!E130","v":"3.2.9"},{"$f":"ListaCriterios!F130","v":"Zonas verdes y espacios de ocio"},{"$f":"ListaCriterios!G130","v":"CALIDAD DEL ESPACIO"},{"$f":"ListaCriterios!H130","v":"3.2.09.d"},{"$f":"ListaCriterios!I130","v":0},{"$f":"ListaCriterios!J130","v":"Estado de conservación y mantenimiento de zonas verdes y espacios de ocio"},{"$f":"ListaCriterios!K130","v":"Grad 1-5"},{"$f":"IF(VLOOKUP(J130,'3.INFRASTRUCTURAS Y SERVICIOS'!I:K,3,FALSE)=\"\",\"no_data\",VLOOKUP(J130,'3.INFRASTRUCTURAS Y SERVICIOS'!I:K,3,FALSE))","v":"no_data"},{"$f":"IF(L130=\"no_data\",0,(IF(K130=\"SI/NO\",IF(L130=\"Sí\",N130,IF(L130=\"No\",O130,P130)),L130)))","v":0},5,0,0,1,0,5,0,{"$f":"ListaCriterios!O130","v":0}]
[{"$f":"ListaCriterios!A131","v":3},{"$f":"ListaCriterios!B131","v":"Infrastructuras y servicios"},{"$f":"ListaCriterios!C131","v":"3.2"},{"$f":"ListaCriterios!D131","v":"Infrastructuras básicas"},{"$f":"ListaCriterios!E131","v":"3.2.9"},{"$f":"ListaCriterios!F131","v":"Zonas verdes y espacios de ocio"},{"$f":"ListaCriterios!G131","v":"CALIDAD DEL ESPACIO"},{"$f":"ListaCriterios!H131","v":"3.2.09.e"},{"$f":"ListaCriterios!I131","v":0},{"$f":"ListaCriterios!J131","v":"¿Existe información visible con los datos de contacto en caso de incidentes?"},{"$f":"ListaCriterios!K131","v":"SI/NO"},{"$f":"IF(VLOOKUP(J131,'3.INFRASTRUCTURAS Y SERVICIOS'!I:K,3,FALSE)=\"\",\"no_data\",VLOOKUP(J131,'3.INFRASTRUCTURAS Y SERVICIOS'!I:K,3,FALSE))","v":"no_data"},0,5,0,0,1,{"$f":"M131*Q131","v":0},{"$f":"Q131*5","v":5},{"$f":"M131/S131","v":0},{"$f":"ListaCriterios!O131","v":0}]
[{"$f":"ListaCriterios!A132","v":3},{"$f":"ListaCriterios!B132","v":"Infrastructuras y servicios"},{"$f":"ListaCriterios!C132","v":"3.2"},{"$f":"ListaCriterios!D132","v":"Infrastructuras básicas"},{"$f":"ListaCriterios!E132","v":"3.2.9"},{"$f":"ListaCriterios!F132","v":"Zonas verdes y espacios de ocio"},{"$f":"ListaCriterios!G132","v":"CALIDAD DEL ESPACIO"},{"$f":"ListaCriterios!H132","v":"3.2.09.f"},{"$f":"ListaCriterios!I132","v":0},{"$f":"ListaCriterios!J132","v":"Los espacios verdes y de ocio son existentes y están habilitados para cada tipo de usuario (por edades, por finalidad, animales, etc) están adecuadamente delimitados e identificados, así como las normas de uso seguro de las instalaciones asignadas a cada uno de ellos?"},{"$f":"ListaCriterios!K132","v":"SI/NO"},{"$f":"'3.INFRASTRUCTURAS Y SERVICIOS'!K115","v":0},0,5,0,0,1,0,5,0,{"$f":"ListaCriterios!O132","v":0}]
[{"$f":"ListaCriterios!A133","v":3},{"$f":"ListaCriterios!B133","v":"Infrastructuras y servicios"},{"$f":"ListaCriterios!C133","v":"3.2"},{"$f":"ListaCriterios!D133","v":"Infrastructuras básicas"},{"$f":"ListaCriterios!E133","v":"3.2.9"},{"$f":"ListaCriterios!F133","v":"Zonas verdes y espacios de ocio"},{"$f":"ListaCriterios!G133","v":"CALIDAD DEL ESPACIO"},{"$f":"ListaCriterios!H133","v":"3.2.09.g"},{"$f":"ListaCriterios!I133","v":"x"},{"$f":"ListaCriterios!J133","v":"Existen espacios habilitados para el uso deportivo (bicicletas, patinaje, etc.) y están adecuadamente señalizados y delimitados en condiciones de seguridad para evitar accidentes con otros usuarios de los espacios"},{"$f":"ListaCriterios!K133","v":"SI/NO"},{"$f":"IF(VLOOKUP(J133,'3.INFRASTRUCTURAS Y SERVICIOS'!I:K,3,FALSE)=\"\",\"no_data\",VLOOKUP(J133,'3.INFRASTRUCTURAS Y SERVICIOS'!I:K,3,FALSE))","v":"no_data"},0,5,0,0,3,0,15,0,{"$f":"ListaCriterios!O133","v":"Crear espacios de ocio y bienestar de uso deportivo pensado para trabajadores, correctamente acotados y mantenidos"}]
[{"$f":"ListaCriterios!A134","v":3},{"$f":"ListaCriterios!B134","v":"Infrastructuras y servicios"},{"$f":"ListaCriterios!C134","v":"3.2"},{"$f":"ListaCriterios!D134","v":"Infrastructuras básicas"},{"$f":"ListaCriterios!E134","v":"3.2.10"},{"$f":"ListaCriterios!F134","v":"Infraest. por emergencias"},{"$f":"ListaCriterios!G134","v":"SEGURIDAD"},{"$f":"ListaCriterios!H134","v":"3.2.10.a"},{"$f":"ListaCriterios!I134","v":0},{"$f":"ListaCriterios!J134","v":"¿Existe un punto de encuentro en una ubicación segura dentro del área empresarial, señalizado y accesible?"},{"$f":"ListaCriterios!K134","v":"SI/NO"},{"$f":"IF(VLOOKUP(J134,'3.INFRASTRUCTURAS Y SERVICIOS'!I:K,3,FALSE)=\"\",\"no_data\",VLOOKUP(J134,'3.INFRASTRUCTURAS Y SERVICIOS'!I:K,3,FALSE))","v":"no_data"},0,5,0,0,1,0,5,0,{"$f":"ListaCriterios!O134","v":0}]
[{"$f":"ListaCriterios!A135","v":3},{"$f":"ListaCriterios!B135","v":"Infrastructuras y servicios"},{"$f":"ListaCriterios!C135","v":"3.2"},{"$f":"ListaCriterios!D135","v":"Infrastructuras básicas"},{"$f":"ListaCriterios!E135","v":"3.2.10"},{"$f":"ListaCriterios!F135","v":"Infraest. por emergencias"},{"$f":"ListaCriterios!G135","v":"SEGURIDAD"},{"$f":"ListaCriterios!H135","v":"3.2.10.b"},{"$f":"ListaCriterios!I135","v":0},{"$f":"ListaCriterios!J135","v":"¿Existe señalización de emergencias y permite un adecuado desalojo en caso necesario?"},{"$f":"ListaCriterios!K135","v":"SI/NO"},{"$f":"IF(VLOOKUP(J135,'3.INFRASTRUCTURAS Y SERVICIOS'!I:K,3,FALSE)=\"\",\"no_data\",VLOOKUP(J135,'3.INFRASTRUCTURAS Y SERVICIOS'!I:K,3,FALSE))","v":"no_data"},0,5,0,0,1,0,5,0,{"$f":"ListaCriterios!O135","v":0}]
[{"$f":"ListaCriterios!A136","v":3},{"$f":"ListaCriterios!B136","v":"Infrastructuras y servicios"},{"$f":"ListaCriterios!C136","v":"3.2"},{"$f":"ListaCriterios!D136","v":"Infrastructuras básicas"},{"$f":"ListaCriterios!E136","v":"3.2.10"},{"$f":"ListaCriterios!F136","v":"Infraest. por emergencias"},{"$f":"ListaCriterios!G136","v":"SEGURIDAD"},{"$f":"ListaCriterios!H136","v":"3.2.10.c"},{"$f":"ListaCriterios!I136","v":0},{"$f":"ListaCriterios!J136","v":"¿Existen evidencias de realización de simulacros o pruebas en la red de emergencias, y de adecuación de ésta a las necesidades del área?"},{"$f":"ListaCriterios!K136","v":"SI/NO"},{"$f":"IF(VLOOKUP(J136,'3.INFRASTRUCTURAS Y SERVICIOS'!I:K,3,FALSE)=\"\",\"no_data\",VLOOKUP(J136,'3.INFRASTRUCTURAS Y SERVICIOS'!I:K,3,FALSE))","v":"no_data"},0,5,0,0,1,0,5,0,{"$f":"ListaCriterios!O136","v":0}]
[{"$f":"ListaCriterios!A137","v":3},{"$f":"ListaCriterios!B137","v":"Infrastructuras y servicios"},{"$f":"ListaCriterios!C137","v":"3.2"},{"$f":"ListaCriterios!D137","v":"Infrastructuras básicas"},{"$f":"ListaCriterios!E137","v":"3.2.10"},{"$f":"ListaCriterios!F137","v":"Infraest. por emergencias"},{"$f":"ListaCriterios!G137","v":"SEGURIDAD"},{"$f":"ListaCriterios!H137","v":"3.2.10.d"},{"$f":"ListaCriterios!I137","v":0},{"$f":"ListaCriterios!J137","v":"Hay red de hidrantes y está en buen estado de conservación"},{"$f":"ListaCriterios!K137","v":"SI/NO"},{"$f":"IF(VLOOKUP(J137,'3.INFRASTRUCTURAS Y SERVICIOS'!I:K,3,FALSE)=\"\",\"no_data\",VLOOKUP(J137,'3.INFRASTRUCTURAS Y SERVICIOS'!I:K,3,FALSE))","v":"no_data"},0,5,0,0,1,0,5,0,{"$f":"ListaCriterios!O137","v":0}]
[{"$f":"ListaCriterios!A138","v":3},{"$f":"ListaCriterios!B138","v":"Infrastructuras y servicios"},{"$f":"ListaCriterios!C138","v":"3.2"},{"$f":"ListaCriterios!D138","v":"Infrastructuras básicas"},{"$f":"ListaCriterios!E138","v":"3.2.10"},{"$f":"ListaCriterios!F138","v":"Infraest. por emergencias"},{"$f":"ListaCriterios!G138","v":"SEGURIDAD"},{"$f":"ListaCriterios!H138","v":"3.2.10.e"},{"$f":"ListaCriterios!I138","v":0},{"$f":"ListaCriterios!J138","v":"¿La señalización de las tomas de la red de hidrantes es adecuada para asegurar que no se obstruyen y son funcionales?"},{"$f":"ListaCriterios!K138","v":"SI/NO"},{"$f":"IF(VLOOKUP(J138,'3.INFRASTRUCTURAS Y SERVICIOS'!I:K,3,FALSE)=\"\",\"no_data\",VLOOKUP(J138,'3.INFRASTRUCTURAS Y SERVICIOS'!I:K,3,FALSE))","v":"no_data"},0,5,0,0,1,0,5,0,{"$f":"ListaCriterios!O138","v":0}]
[{"$f":"ListaCriterios!A139","v":3},{"$f":"ListaCriterios!B139","v":"Infrastructuras y servicios"},{"$f":"ListaCriterios!C139","v":"3.2"},{"$f":"ListaCriterios!D139","v":"Infrastructuras básicas"},{"$f":"ListaCriterios!E139","v":"3.2.10"},{"$f":"ListaCriterios!F139","v":"Infraest. por emergencias"},{"$f":"ListaCriterios!G139","v":"SEGURIDAD"},{"$f":"ListaCriterios!H139","v":"3.2.10.f"},{"$f":"ListaCriterios!I139","v":0},{"$f":"ListaCriterios!J139","v":"¿Se dispone de Plano de la red de hidrantes?"},{"$f":"ListaCriterios!K139","v":"SI/NO"},{"$f":"IF(VLOOKUP(J139,'3.INFRASTRUCTURAS Y SERVICIOS'!I:K,3,FALSE)=\"\",\"no_data\",VLOOKUP(J139,'3.INFRASTRUCTURAS Y SERVICIOS'!I:K,3,FALSE))","v":"no_data"},0,5,0,0,1,0,5,0,{"$f":"ListaCriterios!O139","v":0}]
[{"$f":"ListaCriterios!A140","v":3},{"$f":"ListaCriterios!B140","v":"Infrastructuras y servicios"},{"$f":"ListaCriterios!C140","v":"3.2"},{"$f":"ListaCriterios!D140","v":"Infrastructuras básicas"},{"$f":"ListaCriterios!E140","v":"3.2.10"},{"$f":"ListaCriterios!F140","v":"Infraest. por emergencias"},{"$f":"ListaCriterios!G140","v":"SEGURIDAD"},{"$f":"ListaCriterios!H140","v":"3.2.10.g"},{"$f":"ListaCriterios!I140","v":0},{"$f":"ListaCriterios!J140","v":"¿Se tiene Contrato con organización que lleva a cabo el mantenimiento de hidrantes según la legislación vigente?"},{"$f":"ListaCriterios!K140","v":"SI/NO"},{"$f":"IF(VLOOKUP(J140,'3.INFRASTRUCTURAS Y SERVICIOS'!I:K,3,FALSE)=\"\",\"no_data\",VLOOKUP(J140,'3.INFRASTRUCTURAS Y SERVICIOS'!I:K,3,FALSE))","v":"no_data"},0,5,0,0,1,0,5,0,{"$f":"ListaCriterios!O140","v":0}]
[{"$f":"ListaCriterios!A141","v":3},{"$f":"ListaCriterios!B141","v":"Infrastructuras y servicios"},{"$f":"ListaCriterios!C141","v":"3.2"},{"$f":"ListaCriterios!D141","v":"Infrastructuras básicas"},{"$f":"ListaCriterios!E141","v":"3.2.10"},{"$f":"ListaCriterios!F141","v":"Infraest. por emergencias"},{"$f":"ListaCriterios!G141","v":"SEGURIDAD"},{"$f":"ListaCriterios!H141","v":"3.2.10.h"},{"$f":"ListaCriterios!I141","v":0},{"$f":"ListaCriterios!J141","v":"¿Se dispone de Documentos oficiales que reflejan las principales características de la red de hidrantes (por ejemplo pliego condiciones técnicas de prestación de servicio)?"},{"$f":"ListaCriterios!K141","v":"SI/NO"},{"$f":"IF(VLOOKUP(J141,'3.INFRASTRUCTURAS Y SERVICIOS'!I:K,3,FALSE)=\"\",\"no_data\",VLOOKUP(J141,'3.INFRASTRUCTURAS Y SERVICIOS'!I:K,3,FALSE))","v":"no_data"},0,5,0,0,1,0,5,0,{"$f":"ListaCriterios!O141","v":0}]
[{"$f":"ListaCriterios!A142","v":3},{"$f":"ListaCriterios!B142","v":"Infrastructuras y servicios"},{"$f":"ListaCriterios!C142","v":"3.2"},{"$f":"ListaCriterios!D142","v":"Infrastructuras básicas"},{"$f":"ListaCriterios!E142","v":"3.2.10"},{"$f":"ListaCriterios!F142","v":"Infraest. por emergencias"},{"$f":"ListaCriterios!G142","v":"SEGURIDAD"},{"$f":"ListaCriterios!H142","v":"3.2.10.i"},{"$f":"ListaCriterios!I142","v":0},{"$f":"ListaCriterios!J142","v":"¿Se dispone de registros mantenimiento que evidencien la puesta en marcha periódica y mantenimiento de la red de hidrantes según establece el RD 513/2017?"},{"$f":"ListaCriterios!K142","v":"SI/NO"},{"$f":"IF(VLOOKUP(J142,'3.INFRASTRUCTURAS Y SERVICIOS'!I:K,3,FALSE)=\"\",\"no_data\",VLOOKUP(J142,'3.INFRASTRUCTURAS Y SERVICIOS'!I:K,3,FALSE))","v":"no_data"},0,5,0,0,1,0,5,0,{"$f":"ListaCriterios!O142","v":0}]
[{"$f":"ListaCriterios!A143","v":3},{"$f":"ListaCriterios!B143","v":"Infrastructuras y servicios"},{"$f":"ListaCriterios!C143","v":"3.2"},{"$f":"ListaCriterios!D143","v":"Infrastructuras básicas"},{"$f":"ListaCriterios!E143","v":"3.2.11"},{"$f":"ListaCriterios!F143","v":"Telecomunicaciones"},{"$f":"ListaCriterios!G143","v":"TELECOMUNICACIONES"},{"$f":"ListaCriterios!H143","v":"3.2.11.a"},{"$f":"ListaCriterios!I143","v":"x"},{"$f":"ListaCriterios!J143","v":"¿Llega cobertura de Fibra Óptica en el PAE?"},{"$f":"ListaCriterios!K143","v":"SI/NO"},{"$f":"IF(VLOOKUP(J143,'3.INFRASTRUCTURAS Y SERVICIOS'!I:K,3,FALSE)=\"\",\"no_data\",VLOOKUP(J143,'3.INFRASTRUCTURAS Y SERVICIOS'!I:K,3,FALSE))","v":"no_data"},0,5,0,0,3,0,15,0,{"$f":"ListaCriterios!O143","v":"Fomentar la extensión de la fibra óptica en todo el PAE"}]
[{"$f":"ListaCriterios!A144","v":3},{"$f":"ListaCriterios!B144","v":"Infrastructuras y servicios"},{"$f":"ListaCriterios!C144","v":"3.2"},{"$f":"ListaCriterios!D144","v":"Infrastructuras básicas"},{"$f":"ListaCriterios!E144","v":"3.2.11"},{"$f":"ListaCriterios!F144","v":"Telecomunicaciones"},{"$f":"ListaCriterios!G144","v":"TELECOMUNICACIONES"},{"$f":"ListaCriterios!H144","v":"3.2.11.b"},{"$f":"ListaCriterios!I144","v":0},{"$f":"ListaCriterios!J144","v":"Existe cobertura para servicios móviles en toda el área."},{"$f":"ListaCriterios!K144","v":"SI/NO"},{"$f":"IF(VLOOKUP(J144,'3.INFRASTRUCTURAS Y SERVICIOS'!I:K,3,FALSE)=\"\",\"no_data\",VLOOKUP(J144,'3.INFRASTRUCTURAS Y SERVICIOS'!I:K,3,FALSE))","v":"no_data"},0,5,0,0,1,0,5,0,{"$f":"ListaCriterios!O144","v":0}]
[{"$f":"ListaCriterios!A145","v":3},{"$f":"ListaCriterios!B145","v":"Infrastructuras y servicios"},{"$f":"ListaCriterios!C145","v":"3.2"},{"$f":"ListaCriterios!D145","v":"Infrastructuras básicas"},{"$f":"ListaCriterios!E145","v":"3.2.11"},{"$f":"ListaCriterios!F145","v":"Telecomunicaciones"},{"$f":"ListaCriterios!G145","v":"TELECOMUNICACIONES"},{"$f":"ListaCriterios!H145","v":"3.2.11.c"},{"$f":"ListaCriterios!I145","v":"x"},{"$f":"ListaCriterios!J145","v":"¿Existe cobertura móvil de alta velocidad 4G+, 5G?"},{"$f":"ListaCriterios!K145","v":"Grad 1-5"},{"$f":"IF(VLOOKUP(J145,'3.INFRASTRUCTURAS Y SERVICIOS'!I:K,3,FALSE)=\"\",\"no_data\",VLOOKUP(J145,'3.INFRASTRUCTURAS Y SERVICIOS'!I:K,3,FALSE))","v":"no_data"},0,5,0,0,3,0,15,0,{"$f":"ListaCriterios!O145","v":"Fomentar la cobertura móvil de alta velocidad, preferiblemente 5G, en todo el PAE"}]
[{"$f":"ListaCriterios!A146","v":3},{"$f":"ListaCriterios!B146","v":"Infrastructuras y servicios"},{"$f":"ListaCriterios!C146","v":"3.2"},{"$f":"ListaCriterios!D146","v":"Infrastructuras básicas"},{"$f":"ListaCriterios!E146","v":"3.2.11"},{"$f":"ListaCriterios!F146","v":"Telecomunicaciones"},{"$f":"ListaCriterios!G146","v":"TELECOMUNICACIONES"},{"$f":"ListaCriterios!H146","v":"3.2.11.d"},{"$f":"ListaCriterios!I146","v":0},{"$f":"ListaCriterios!J146","v":"Grado de despliegue y velocidad de la red telecomunicaciones en el PAE"},{"$f":"ListaCriterios!K146","v":"Grad 1-5"},{"$f":"IF(VLOOKUP(J146,'3.INFRASTRUCTURAS Y SERVICIOS'!I:K,3,FALSE)=\"\",\"no_data\",VLOOKUP(J146,'3.INFRASTRUCTURAS Y SERVICIOS'!I:K,3,FALSE))","v":"no_data"},0,5,0,0,1,0,5,0,{"$f":"ListaCriterios!O146","v":0}]
[{"$f":"ListaCriterios!A147","v":3},{"$f":"ListaCriterios!B147","v":"Infrastructuras y servicios"},{"$f":"ListaCriterios!C147","v":"3.2"},{"$f":"ListaCriterios!D147","v":"Infrastructuras básicas"},{"$f":"ListaCriterios!E147","v":"3.2.11"},{"$f":"ListaCriterios!F147","v":"Telecomunicaciones"},{"$f":"ListaCriterios!G147","v":"TELECOMUNICACIONES"},{"$f":"ListaCriterios!H147","v":"3.2.11.e"},{"$f":"ListaCriterios!I147","v":0},{"$f":"ListaCriterios!J147","v":"Las antenas repetidoras de señal en zonas públicas (en su caso) están señalizadas y con acceso controlado"},{"$f":"ListaCriterios!K147","v":"SI/NO"},{"$f":"IF(VLOOKUP(J147,'3.INFRASTRUCTURAS Y SERVICIOS'!I:K,3,FALSE)=\"\",\"no_data\",VLOOKUP(J147,'3.INFRASTRUCTURAS Y SERVICIOS'!I:K,3,FALSE))","v":"no_data"},0,5,0,0,1,0,5,0,{"$f":"ListaCriterios!O147","v":0}]
[{"$f":"ListaCriterios!A148","v":3},{"$f":"ListaCriterios!B148","v":"Infrastructuras y servicios"},{"$f":"ListaCriterios!C148","v":"3.2"},{"$f":"ListaCriterios!D148","v":"Infrastructuras básicas"},{"$f":"ListaCriterios!E148","v":"3.2.11"},{"$f":"ListaCriterios!F148","v":"Telecomunicaciones"},{"$f":"ListaCriterios!G148","v":"TELECOMUNICACIONES"},{"$f":"ListaCriterios!H148","v":"3.2.11.f"},{"$f":"ListaCriterios!I148","v":0},{"$f":"ListaCriterios!J148","v":"Las información sobre las características de la red de comunicaciones aparecen adecuadamente reflejadas en la publicidad del área"},{"$f":"ListaCriterios!K148","v":"SI/NO"},{"$f":"IF(VLOOKUP(J148,'3.INFRASTRUCTURAS Y SERVICIOS'!I:K,3,FALSE)=\"\",\"no_data\",VLOOKUP(J148,'3.INFRASTRUCTURAS Y SERVICIOS'!I:K,3,FALSE))","v":"no_data"},0,5,0,0,1,0,5,0,{"$f":"ListaCriterios!O148","v":0}]
[{"$f":"ListaCriterios!A149","v":3},{"$f":"ListaCriterios!B149","v":"Infrastructuras y servicios"},{"$f":"ListaCriterios!C149","v":"3.2"},{"$f":"ListaCriterios!D149","v":"Infrastructuras básicas"},{"$f":"ListaCriterios!E149","v":"3.2.11"},{"$f":"ListaCriterios!F149","v":"Telecomunicaciones"},{"$f":"ListaCriterios!G149","v":"TELECOMUNICACIONES"},{"$f":"ListaCriterios!H149","v":"3.2.11.g"},{"$f":"ListaCriterios!I149","v":0},{"$f":"ListaCriterios!J149","v":"¿Se dispone de Documentos oficiales que reflejan las principales características de la red telecomunicaciones (por ejemplo pliego condiciones técnicas de prestación de servicio)?"},{"$f":"ListaCriterios!K149","v":"SI/NO"},{"$f":"IF(VLOOKUP(J149,'3.INFRASTRUCTURAS Y SERVICIOS'!I:K,3,FALSE)=\"\",\"no_data\",VLOOKUP(J149,'3.INFRASTRUCTURAS Y SERVICIOS'!I:K,3,FALSE))","v":"no_data"},0,5,0,0,1,0,5,0,{"$f":"ListaCriterios!O149","v":0}]
[{"$f":"ListaCriterios!A150","v":3},{"$f":"ListaCriterios!B150","v":"Infrastructuras y servicios"},{"$f":"ListaCriterios!C150","v":"3.2"},{"$f":"ListaCriterios!D150","v":"Infrastructuras básicas"},{"$f":"ListaCriterios!E150","v":"3.2.11"},{"$f":"ListaCriterios!F150","v":"Telecomunicaciones"},{"$f":"ListaCriterios!G150","v":"TELECOMUNICACIONES"},{"$f":"ListaCriterios!H150","v":"3.2.11.h"},{"$f":"ListaCriterios!I150","v":0},{"$f":"ListaCriterios!J150","v":"Estado de conservación de elementos visibles de la red de comunicaciones. Especialmente, en su caso, las casetas o cajas de conexiones"},{"$f":"ListaCriterios!K150","v":"Grad 1-5"},{"$f":"IF(VLOOKUP(J150,'3.INFRASTRUCTURAS Y SERVICIOS'!I:K,3,FALSE)=\"\",\"no_data\",VLOOKUP(J150,'3.INFRASTRUCTURAS Y SERVICIOS'!I:K,3,FALSE))","v":"no_data"},0,5,0,0,1,0,5,0,{"$f":"ListaCriterios!O150","v":0}]
[{"$f":"ListaCriterios!A151","v":3},{"$f":"ListaCriterios!B151","v":"Infrastructuras y servicios"},{"$f":"ListaCriterios!C151","v":"3.2"},{"$f":"ListaCriterios!D151","v":"Infrastructuras básicas"},{"$f":"ListaCriterios!E151","v":"3.2.11"},{"$f":"ListaCriterios!F151","v":"Telecomunicaciones"},{"$f":"ListaCriterios!G151","v":"TELECOMUNICACIONES"},{"$f":"ListaCriterios!H151","v":"3.2.11.i"},{"$f":"ListaCriterios!I151","v":0},{"$f":"ListaCriterios!J151","v":"¿Se tiene el contrato de prestación de servicio de telecomunicaciones (por ejemplo, adjudicación pública del servicio)?"},{"$f":"ListaCriterios!K151","v":"SI/NO"},{"$f":"IF(VLOOKUP(J151,'3.INFRASTRUCTURAS Y SERVICIOS'!I:K,3,FALSE)=\"\",\"no_data\",VLOOKUP(J151,'3.INFRASTRUCTURAS Y SERVICIOS'!I:K,3,FALSE))","v":"no_data"},0,5,0,0,1,0,5,0,{"$f":"ListaCriterios!O151","v":0}]
[{"$f":"ListaCriterios!A152","v":3},{"$f":"ListaCriterios!B152","v":"Infrastructuras y servicios"},{"$f":"ListaCriterios!C152","v":"3.2"},{"$f":"ListaCriterios!D152","v":"Infrastructuras básicas"},{"$f":"ListaCriterios!E152","v":"3.2.11"},{"$f":"ListaCriterios!F152","v":"Telecomunicaciones"},{"$f":"ListaCriterios!G152","v":"TELECOMUNICACIONES"},{"$f":"ListaCriterios!H152","v":"3.2.11.j"},{"$f":"ListaCriterios!I152","v":0},{"$f":"ListaCriterios!J152","v":"¿Se dispone de Plano de canalizaciones (de ser el caso, por proveedor)?"},{"$f":"ListaCriterios!K152","v":"SI/NO"},{"$f":"IF(VLOOKUP(J152,'3.INFRASTRUCTURAS Y SERVICIOS'!I:K,3,FALSE)=\"\",\"no_data\",VLOOKUP(J152,'3.INFRASTRUCTURAS Y SERVICIOS'!I:K,3,FALSE))","v":"no_data"},0,5,0,0,1,0,5,0,{"$f":"ListaCriterios!O152","v":0}]
[{"$f":"ListaCriterios!A153","v":3},{"$f":"ListaCriterios!B153","v":"Infrastructuras y servicios"},{"$f":"ListaCriterios!C153","v":"3.2"},{"$f":"ListaCriterios!D153","v":"Infrastructuras básicas"},{"$f":"ListaCriterios!E153","v":"3.2.11"},{"$f":"ListaCriterios!F153","v":"Telecomunicaciones"},{"$f":"ListaCriterios!G153","v":"TELECOMUNICACIONES"},{"$f":"ListaCriterios!H153","v":"3.2.11.k"},{"$f":"ListaCriterios!I153","v":0},{"$f":"ListaCriterios!J153","v":"¿Se dispone de registro de incidencias (graves) en la infraestructura?"},{"$f":"ListaCriterios!K153","v":"SI/NO"},{"$f":"IF(VLOOKUP(J153,'3.INFRASTRUCTURAS Y SERVICIOS'!I:K,3,FALSE)=\"\",\"no_data\",VLOOKUP(J153,'3.INFRASTRUCTURAS Y SERVICIOS'!I:K,3,FALSE))","v":"no_data"},0,5,0,0,1,0,5,0,{"$f":"ListaCriterios!O153","v":0}]
[{"$f":"ListaCriterios!A154","v":3},{"$f":"ListaCriterios!B154","v":"Infrastructuras y servicios"},{"$f":"ListaCriterios!C154","v":"3.3"},{"$f":"ListaCriterios!D154","v":"Serveis avançats i/o compartits"},{"$f":"ListaCriterios!E154","v":"3.3.1"},{"$f":"ListaCriterios!F154","v":"financiación"},{"$f":"ListaCriterios!G154","v":"COLABORACIÓN"},{"$f":"ListaCriterios!H154","v":"3.3.01.a"},{"$f":"ListaCriterios!I154","v":"x"},{"$f":"ListaCriterios!J154","v":"¿Se ofrecen servicios especiales de financiación a las empresas? (Gestor financiero)"},{"$f":"ListaCriterios!K154","v":"SI/NO"},{"$f":"IF(VLOOKUP(J154,'3.INFRASTRUCTURAS Y SERVICIOS'!I:K,3,FALSE)=\"\",\"no_data\",VLOOKUP(J154,'3.INFRASTRUCTURAS Y SERVICIOS'!I:K,3,FALSE))","v":"no_data"},0,5,0,0,3,0,15,0,{"$f":"ListaCriterios!O154","v":"Ofrecer un servicio de gestor financiero a las empresas del PAE"}]
[{"$f":"ListaCriterios!A155","v":3},{"$f":"ListaCriterios!B155","v":"Infrastructuras y servicios"},{"$f":"ListaCriterios!C155","v":"3.3"},{"$f":"ListaCriterios!D155","v":"Servicios avanzados y/o compartidos"},{"$f":"ListaCriterios!E155","v":"3.3.2"},{"$f":"ListaCriterios!F155","v":"Asistencia a la innovación"},{"$f":"ListaCriterios!G155","v":"COLABORACIÓN"},{"$f":"ListaCriterios!H155","v":"3.3.02.a"},{"$f":"ListaCriterios!I155","v":"x"},{"$f":"ListaCriterios!J155","v":"¿Se ofrece servicio para ayudar a las empresas a innovar?"},{"$f":"ListaCriterios!K155","v":"SI/NO"},{"$f":"IF(VLOOKUP(J155,'3.INFRASTRUCTURAS Y SERVICIOS'!I:K,3,FALSE)=\"\",\"no_data\",VLOOKUP(J155,'3.INFRASTRUCTURAS Y SERVICIOS'!I:K,3,FALSE))","v":"no_data"},0,5,0,0,3,0,15,0,{"$f":"ListaCriterios!O155","v":"Ofrecer un servicio de asistencia a la innovación en las empresas del PAE"}]
[{"$f":"ListaCriterios!A156","v":3},{"$f":"ListaCriterios!B156","v":"Infrastructuras y servicios"},{"$f":"ListaCriterios!C156","v":"3.3"},{"$f":"ListaCriterios!D156","v":"Servicios avanzados y/o compartidos"},{"$f":"ListaCriterios!E156","v":"3.3.3"},{"$f":"ListaCriterios!F156","v":"Centro de servicios"},{"$f":"ListaCriterios!G156","v":"COLABORACIÓN"},{"$f":"ListaCriterios!H156","v":"3.3.03.a"},{"$f":"ListaCriterios!I156","v":"x"},{"$f":"ListaCriterios!J156","v":"¿Existe un centro físico/oficina/oficina virtual de servicios?"},{"$f":"ListaCriterios!K156","v":"SI/NO"},{"$f":"IF(VLOOKUP(J156,'3.INFRASTRUCTURAS Y SERVICIOS'!I:K,3,FALSE)=\"\",\"no_data\",VLOOKUP(J156,'3.INFRASTRUCTURAS Y SERVICIOS'!I:K,3,FALSE))","v":"no_data"},0,5,0,0,3,0,15,0,{"$f":"ListaCriterios!O156","v":"Implusar y crear un centro de servicios en las empresas desde la gestión del PAE (oficina física o virtual)"}]
[{"$f":"ListaCriterios!A157","v":3},{"$f":"ListaCriterios!B157","v":"Infrastructuras y servicios"},{"$f":"ListaCriterios!C157","v":"3.3"},{"$f":"ListaCriterios!D157","v":"Servicios avanzados y/o compartidos"},{"$f":"ListaCriterios!E157","v":"3.3.4"},{"$f":"ListaCriterios!F157","v":"Gestor energética/ambiental"},{"$f":"ListaCriterios!G157","v":"ENERGÍA Y CAMBIO CLIMATIC"},{"$f":"ListaCriterios!H157","v":"3.3.04.a"},{"$f":"ListaCriterios!I157","v":"x"},{"$f":"ListaCriterios!J157","v":"¿Se promociona la energía compartida desde la gestión del PAE?"},{"$f":"ListaCriterios!K157","v":"SI/NO"},{"$f":"IF(VLOOKUP(J157,'3.INFRASTRUCTURAS Y SERVICIOS'!I:K,3,FALSE)=\"\",\"no_data\",VLOOKUP(J157,'3.INFRASTRUCTURAS Y SERVICIOS'!I:K,3,FALSE))","v":"no_data"},0,5,0,0,3,0,15,0,{"$f":"ListaCriterios!O157","v":"Promover las iniciativas de energía compartida"}]
[{"$f":"ListaCriterios!A158","v":3},{"$f":"ListaCriterios!B158","v":"Infrastructuras y servicios"},{"$f":"ListaCriterios!C158","v":"3.3"},{"$f":"ListaCriterios!D158","v":"Servicios avanzados y/o compartidos"},{"$f":"ListaCriterios!E158","v":"3.3.4"},{"$f":"ListaCriterios!F158","v":"Gestor energética/ambiental"},{"$f":"ListaCriterios!G158","v":"ENERGÍA Y CAMBIO CLIMATIC"},{"$f":"ListaCriterios!H158","v":"3.3.04.b"},{"$f":"ListaCriterios!I158","v":"x"},{"$f":"ListaCriterios!J158","v":"¿Se ofrece una central de compras en materia energética (placas solares, comprar verde energética, etc)?"},{"$f":"ListaCriterios!K158","v":"SI/NO"},{"$f":"IF(VLOOKUP(J158,'3.INFRASTRUCTURAS Y SERVICIOS'!I:K,3,FALSE)=\"\",\"no_data\",VLOOKUP(J158,'3.INFRASTRUCTURAS Y SERVICIOS'!I:K,3,FALSE))","v":"no_data"},0,5,0,0,3,0,15,0,{"$f":"ListaCriterios!O158","v":"Crear una central de compras de energía (placas solares, energía verde certificada, biomasa, etc)"}]
[{"$f":"ListaCriterios!A159","v":3},{"$f":"ListaCriterios!B159","v":"Infrastructuras y servicios"},{"$f":"ListaCriterios!C159","v":"3.3"},{"$f":"ListaCriterios!D159","v":"Servicios avanzados y/o compartidos"},{"$f":"ListaCriterios!E159","v":"3.3.4"},{"$f":"ListaCriterios!F159","v":"Gestor energética/ambiental"},{"$f":"ListaCriterios!G159","v":"ENERGÍA Y CAMBIO CLIMATIC"},{"$f":"ListaCriterios!H159","v":"3.3.04.c"},{"$f":"ListaCriterios!I159","v":"x"},{"$f":"ListaCriterios!J159","v":"¿Existe la figura del gestor energético y/o gestor ambiental?"},{"$f":"ListaCriterios!K159","v":"SI/NO"},{"$f":"IF(VLOOKUP(J159,'3.INFRASTRUCTURAS Y SERVICIOS'!I:K,3,FALSE)=\"\",\"no_data\",VLOOKUP(J159,'3.INFRASTRUCTURAS Y SERVICIOS'!I:K,3,FALSE))","v":"no_data"},0,5,0,0,3,0,15,0,{"$f":"ListaCriterios!O159","v":"Ofrecer un servicio de gestión energética y/o ambiental"}]
[{"$f":"ListaCriterios!A160","v":3},{"$f":"ListaCriterios!B160","v":"Infrastructuras y servicios"},{"$f":"ListaCriterios!C160","v":"3.3"},{"$f":"ListaCriterios!D160","v":"Servicios avanzados y/o compartidos"},{"$f":"ListaCriterios!E160","v":"3.3.5"},{"$f":"ListaCriterios!F160","v":"Servicios para la movilidad sostenible"},{"$f":"ListaCriterios!G160","v":"MOVILIDAD"},{"$f":"ListaCriterios!H160","v":"3.3.05.a"},{"$f":"ListaCriterios!I160","v":"x"},{"$f":"ListaCriterios!J160","v":"¿Se ha puesto en marcha o implulsado algún servicio de vehículos compartidos? (Carsharing, bicicletas compartidas, motocicletas eléctricas, patinetes…)"},{"$f":"ListaCriterios!K160","v":"SI/NO"},{"$f":"IF(VLOOKUP(J160,'3.INFRASTRUCTURAS Y SERVICIOS'!I:K,3,FALSE)=\"\",\"no_data\",VLOOKUP(J160,'3.INFRASTRUCTURAS Y SERVICIOS'!I:K,3,FALSE))","v":"no_data"},0,5,0,0,3,0,15,0,{"$f":"ListaCriterios!O160","v":"Poner en marcha o impulsar un servicio de vehículos compartidos (Carsharing, bicicletas compartidas, motocicletas eléctricas, patinetes…)"}]
[{"$f":"ListaCriterios!A161","v":3},{"$f":"ListaCriterios!B161","v":"Infrastructuras y servicios"},{"$f":"ListaCriterios!C161","v":"3.3"},{"$f":"ListaCriterios!D161","v":"Servicios avanzados y/o compartidos"},{"$f":"ListaCriterios!E161","v":"3.3.6"},{"$f":"ListaCriterios!F161","v":"Servicios a la exportación"},{"$f":"ListaCriterios!G161","v":"MOVILIDAD"},{"$f":"ListaCriterios!H161","v":"3.3.06.a"},{"$f":"ListaCriterios!I161","v":"x"},{"$f":"ListaCriterios!J161","v":"¿Se ofrecen servicios para facilitar la distribución de mercancías?"},{"$f":"ListaCriterios!K161","v":"SI/NO"},{"$f":"IF(VLOOKUP(J161,'3.INFRASTRUCTURAS Y SERVICIOS'!I:K,3,FALSE)=\"\",\"no_data\",VLOOKUP(J161,'3.INFRASTRUCTURAS Y SERVICIOS'!I:K,3,FALSE))","v":"no_data"},0,5,0,0,3,0,15,0,{"$f":"ListaCriterios!O161","v":"Crear iniciativas para una distribución eficiente y sostenible de mercancías tanto de entrada como internas como de salida del PAE"}]
[{"$f":"ListaCriterios!A162","v":3},{"$f":"ListaCriterios!B162","v":"Infrastructuras y servicios"},{"$f":"ListaCriterios!C162","v":"3.3"},{"$f":"ListaCriterios!D162","v":"Servicios avanzados y/o compartidos"},{"$f":"ListaCriterios!E162","v":"3.3.7"},{"$f":"ListaCriterios!F162","v":"Mensajería y logística"},{"$f":"ListaCriterios!G162","v":"MOVILIDAD"},{"$f":"ListaCriterios!H162","v":"3.3.07.a"},{"$f":"ListaCriterios!I162","v":"x"},{"$f":"ListaCriterios!J162","v":"¿Se dispone de servicio mancomunado de mensajería?"},{"$f":"ListaCriterios!K162","v":"SI/NO"},{"$f":"IF(VLOOKUP(J162,'3.INFRASTRUCTURAS Y SERVICIOS'!I:K,3,FALSE)=\"\",\"no_data\",VLOOKUP(J162,'3.INFRASTRUCTURAS Y SERVICIOS'!I:K,3,FALSE))","v":"no_data"},0,5,0,0,3,0,15,0,{"$f":"ListaCriterios!O162","v":"Ofrecer un servicio agregado o mancomunado de mensajería"}]
[{"$f":"ListaCriterios!A163","v":3},{"$f":"ListaCriterios!B163","v":"Infrastructuras y servicios"},{"$f":"ListaCriterios!C163","v":"3.3"},{"$f":"ListaCriterios!D163","v":"Servicios avanzados y/o compartidos"},{"$f":"ListaCriterios!E163","v":"3.3.7"},{"$f":"ListaCriterios!F163","v":"Mensajería y logística"},{"$f":"ListaCriterios!G163","v":"MOVILIDAD"},{"$f":"ListaCriterios!H163","v":"3.3.07.b"},{"$f":"ListaCriterios!I163","v":"x"},{"$f":"ListaCriterios!J163","v":"¿Se dispone de servicios logísticos compartidos o integrados?"},{"$f":"ListaCriterios!K163","v":"SI/NO"},{"$f":"IF(VLOOKUP(J163,'3.INFRASTRUCTURAS Y SERVICIOS'!I:K,3,FALSE)=\"\",\"no_data\",VLOOKUP(J163,'3.INFRASTRUCTURAS Y SERVICIOS'!I:K,3,FALSE))","v":"no_data"},0,5,0,0,3,0,15,0,{"$f":"ListaCriterios!O163","v":"Impulsar y/o fomentar servicios logísticos compartidos o integrados"}]
[{"$f":"ListaCriterios!A164","v":3},{"$f":"ListaCriterios!B164","v":"Infrastructuras y servicios"},{"$f":"ListaCriterios!C164","v":"3.3"},{"$f":"ListaCriterios!D164","v":"Servicios avanzados y/o compartidos"},{"$f":"ListaCriterios!E164","v":"3.3.8"},{"$f":"ListaCriterios!F164","v":"Movilidad compartida"},{"$f":"ListaCriterios!G164","v":"MOVILIDAD"},{"$f":"ListaCriterios!H164","v":"3.3.08.a"},{"$f":"ListaCriterios!I164","v":"x"},{"$f":"ListaCriterios!J164","v":"¿Se ofrece o promociona algún sistema o plataforma de movilidad compartida por trabajadores?"},{"$f":"ListaCriterios!K164","v":"SI/NO"},{"$f":"IF(VLOOKUP(J164,'3.INFRASTRUCTURAS Y SERVICIOS'!I:K,3,FALSE)=\"\",\"no_data\",VLOOKUP(J164,'3.INFRASTRUCTURAS Y SERVICIOS'!I:K,3,FALSE))","v":"no_data"},0,5,0,0,3,0,15,0,{"$f":"ListaCriterios!O164","v":"Ofrecer y/o promocionar algún sistema de movilidad compartida por trabajadores del PAE"}]
[{"$f":"ListaCriterios!A165","v":3},{"$f":"ListaCriterios!B165","v":"Infrastructuras y servicios"},{"$f":"ListaCriterios!C165","v":"3.3"},{"$f":"ListaCriterios!D165","v":"Servicios avanzados y/o compartidos"},{"$f":"ListaCriterios!E165","v":"3.3.9"},{"$f":"ListaCriterios!F165","v":"Mantenimiento de parcelas vacías"},{"$f":"ListaCriterios!G165","v":"CALIDAD DEL ESPACIO"},{"$f":"ListaCriterios!H165","v":"3.3.09.a"},{"$f":"ListaCriterios!I165","v":"x"},{"$f":"ListaCriterios!J165","v":"¿Se tiene una relación de las parcelas vacías y ubicación en planos?"},{"$f":"ListaCriterios!K165","v":"SI/NO"},{"$f":"IF(VLOOKUP(J165,'3.INFRASTRUCTURAS Y SERVICIOS'!I:K,3,FALSE)=\"\",\"no_data\",VLOOKUP(J165,'3.INFRASTRUCTURAS Y SERVICIOS'!I:K,3,FALSE))","v":"no_data"},0,5,0,0,3,0,15,0,{"$f":"ListaCriterios!O165","v":"Disponer de cartografía actualizada de parcelas vacías, en el sentido de disponer de un servicio de gestión de ofertas y demandas."}]
[{"$f":"ListaCriterios!A166","v":3},{"$f":"ListaCriterios!B166","v":"Infrastructuras y servicios"},{"$f":"ListaCriterios!C166","v":"3.3"},{"$f":"ListaCriterios!D166","v":"Servicios avanzados y/o compartidos"},{"$f":"ListaCriterios!E166","v":"3.3.9"},{"$f":"ListaCriterios!F166","v":"Mantenimiento de parcelas vacías"},{"$f":"ListaCriterios!G166","v":"CALIDAD DEL ESPACIO"},{"$f":"ListaCriterios!H166","v":"3.3.09.b"},{"$f":"ListaCriterios!I166","v":"x"},{"$f":"ListaCriterios!J166","v":"¿Se tienen registros asociados al mantenimiento de parcelas (por ejemplo, limpieza de maleza, residuos etc.)?"},{"$f":"ListaCriterios!K166","v":"SI/NO"},{"$f":"IF(VLOOKUP(J166,'3.INFRASTRUCTURAS Y SERVICIOS'!I:K,3,FALSE)=\"\",\"no_data\",VLOOKUP(J166,'3.INFRASTRUCTURAS Y SERVICIOS'!I:K,3,FALSE))","v":"no_data"},0,5,0,0,3,0,15,0,{"$f":"ListaCriterios!O166","v":"Registrar las actuaciones de mantenimiento de parcelas relacionadas con la limpieza, malas hierbas, limpieza de vertidos incontrolados de residuos, etc"}]
[{"$f":"ListaCriterios!A167","v":3},{"$f":"ListaCriterios!B167","v":"Infrastructuras y servicios"},{"$f":"ListaCriterios!C167","v":"3.3"},{"$f":"ListaCriterios!D167","v":"Servicios avanzados y/o compartidos"},{"$f":"ListaCriterios!E167","v":"3.3.9"},{"$f":"ListaCriterios!F167","v":"Mantenimiento de parcelas vacías"},{"$f":"ListaCriterios!G167","v":"CALIDAD DEL ESPACIO"},{"$f":"ListaCriterios!H167","v":"3.3.09.c"},{"$f":"ListaCriterios!I167","v":"x"},{"$f":"ListaCriterios!J167","v":"Estado de las parcelas vacías"},{"$f":"ListaCriterios!K167","v":"Grad 1-5"},{"$f":"IF(VLOOKUP(J167,'3.INFRASTRUCTURAS Y SERVICIOS'!I:K,3,FALSE)=\"\",\"no_data\",VLOOKUP(J167,'3.INFRASTRUCTURAS Y SERVICIOS'!I:K,3,FALSE))","v":"no_data"},0,5,0,0,3,0,15,0,{"$f":"ListaCriterios!O167","v":"Velar por un correcto mantenimiento de las parcelas vacías por una mejora de la imagen, seguridad, evitar plagas, etc."}]
[{"$f":"ListaCriterios!A168","v":3},{"$f":"ListaCriterios!B168","v":"Infrastructuras y servicios"},{"$f":"ListaCriterios!C168","v":"3.3"},{"$f":"ListaCriterios!D168","v":"Servicios avanzados y/o compartidos"},{"$f":"ListaCriterios!E168","v":"3.3.9"},{"$f":"ListaCriterios!F168","v":"Mantenimiento de parcelas vacías"},{"$f":"ListaCriterios!G168","v":"CALIDAD DEL ESPACIO"},{"$f":"ListaCriterios!H168","v":"3.3.09.d"},{"$f":"ListaCriterios!I168","v":"x"},{"$f":"ListaCriterios!J168","v":"Existen acuerdos con los titulares de las parcelas para su mantenimiento o, en su defecto, con administración competente"},{"$f":"ListaCriterios!K168","v":"SI/NO"},{"$f":"IF(VLOOKUP(J168,'3.INFRASTRUCTURAS Y SERVICIOS'!I:K,3,FALSE)=\"\",\"no_data\",VLOOKUP(J168,'3.INFRASTRUCTURAS Y SERVICIOS'!I:K,3,FALSE))","v":"no_data"},0,5,0,0,3,0,15,0,{"$f":"ListaCriterios!O168","v":"Crear acuerdos con los titulares de parcelas para su mantenimiento"}]
[{"$f":"ListaCriterios!A169","v":3},{"$f":"ListaCriterios!B169","v":"Infrastructuras y servicios"},{"$f":"ListaCriterios!C169","v":"3.3"},{"$f":"ListaCriterios!D169","v":"Servicios avanzados y/o compartidos"},{"$f":"ListaCriterios!E169","v":"3.3.9"},{"$f":"ListaCriterios!F169","v":"Mantenimiento de parcelas vacías"},{"$f":"ListaCriterios!G169","v":"CALIDAD DEL ESPACIO"},{"$f":"ListaCriterios!H169","v":"3.3.09.e"},{"$f":"ListaCriterios!I169","v":"x"},{"$f":"ListaCriterios!J169","v":"¿Están las parcelas vacías cerradas al acceso al público?"},{"$f":"ListaCriterios!K169","v":"SI/NO"},{"$f":"IF(VLOOKUP(J169,'3.INFRASTRUCTURAS Y SERVICIOS'!I:K,3,FALSE)=\"\",\"no_data\",VLOOKUP(J169,'3.INFRASTRUCTURAS Y SERVICIOS'!I:K,3,FALSE))","v":"no_data"},0,5,0,0,3,0,15,0,{"$f":"ListaCriterios!O169","v":"Velar por que las parcelas vacías estén cerradas al público"}]
[{"$f":"ListaCriterios!A170","v":3},{"$f":"ListaCriterios!B170","v":"Infrastructuras y servicios"},{"$f":"ListaCriterios!C170","v":"3.3"},{"$f":"ListaCriterios!D170","v":"Servicios avanzados y/o compartidos"},{"$f":"ListaCriterios!E170","v":"3.3.10"},{"$f":"ListaCriterios!F170","v":"Espacios de bienestar (servicios a las personas)"},{"$f":"ListaCriterios!G170","v":"CALIDAD DEL ESPACIO"},{"$f":"ListaCriterios!H170","v":"3.3.10.a"},{"$f":"ListaCriterios!I170","v":"x"},{"$f":"ListaCriterios!J170","v":"¿Existen espacios de bienestar para personas tales como gimnasio, espacios de ocio, fisioterapia…?"},{"$f":"ListaCriterios!K170","v":"SI/NO"},{"$f":"IF(VLOOKUP(J170,'3.INFRASTRUCTURAS Y SERVICIOS'!I:K,3,FALSE)=\"\",\"no_data\",VLOOKUP(J170,'3.INFRASTRUCTURAS Y SERVICIOS'!I:K,3,FALSE))","v":"no_data"},0,5,0,0,3,0,15,0,{"$f":"ListaCriterios!O170","v":"Promoción de espacios y servicios de bienestar por las personas (pensado por trabajadores y familiares), como espacios de ocio, gimnasio, fisioterapia, etc."}]
[{"$f":"ListaCriterios!A171","v":3},{"$f":"ListaCriterios!B171","v":"Infrastructuras y servicios"},{"$f":"ListaCriterios!C171","v":"3.3"},{"$f":"ListaCriterios!D171","v":"Servicios avanzados y/o compartidos"},{"$f":"ListaCriterios!E171","v":"3.3.11"},{"$f":"ListaCriterios!F171","v":"Bolsa de subproductos/desechería industrial"},{"$f":"ListaCriterios!G171","v":"RESIDUOS"},{"$f":"ListaCriterios!H171","v":"3.3.11.a"},{"$f":"ListaCriterios!I171","v":"x"},{"$f":"ListaCriterios!J171","v":"¿Existe bolsa de subproductos?"},{"$f":"ListaCriterios!K171","v":"SI/NO"},{"$f":"IF(VLOOKUP(J171,'3.INFRASTRUCTURAS Y SERVICIOS'!I:K,3,FALSE)=\"\",\"no_data\",VLOOKUP(J171,'3.INFRASTRUCTURAS Y SERVICIOS'!I:K,3,FALSE))","v":"no_data"},0,5,0,0,3,0,15,0,{"$f":"ListaCriterios!O171","v":"Crear, impulsar o inscribirse en un servicio de bolsa de subproductos y recursos industriales"}]
[{"$f":"ListaCriterios!A172","v":3},{"$f":"ListaCriterios!B172","v":"Infrastructuras y servicios"},{"$f":"ListaCriterios!C172","v":"3.3"},{"$f":"ListaCriterios!D172","v":"Servicios avanzados y/o compartidos"},{"$f":"ListaCriterios!E172","v":"3.3.11"},{"$f":"ListaCriterios!F172","v":"Bolsa de subproductos/desechería industrial"},{"$f":"ListaCriterios!G172","v":"RESIDUOS"},{"$f":"ListaCriterios!H172","v":"3.3.11.b"},{"$f":"ListaCriterios!I172","v":"x"},{"$f":"ListaCriterios!J172","v":"¿Existe scrap-store o similar?"},{"$f":"ListaCriterios!K172","v":"SI/NO"},{"$f":"IF(VLOOKUP(J172,'3.INFRASTRUCTURAS Y SERVICIOS'!I:K,3,FALSE)=\"\",\"no_data\",VLOOKUP(J172,'3.INFRASTRUCTURAS Y SERVICIOS'!I:K,3,FALSE))","v":"no_data"},0,5,0,0,3,0,15,0,{"$f":"ListaCriterios!O172","v":"Crear, impulsar o inscribirse en un servicio de Scrap-Store o similar"}]
[{"$f":"ListaCriterios!A173","v":3},{"$f":"ListaCriterios!B173","v":"Infrastructuras y servicios"},{"$f":"ListaCriterios!C173","v":"3.3"},{"$f":"ListaCriterios!D173","v":"Servicios avanzados y/o compartidos"},{"$f":"ListaCriterios!E173","v":"3.3.11"},{"$f":"ListaCriterios!F173","v":"Bolsa de subproductos/desechería industrial"},{"$f":"ListaCriterios!G173","v":"RESIDUOS"},{"$f":"ListaCriterios!H173","v":"3.3.11.c"},{"$f":"ListaCriterios!I173","v":"x"},{"$f":"ListaCriterios!J173","v":"¿Existe centro de recogida industrial?"},{"$f":"ListaCriterios!K173","v":"SI/NO"},{"$f":"IF(VLOOKUP(J173,'3.INFRASTRUCTURAS Y SERVICIOS'!I:K,3,FALSE)=\"\",\"no_data\",VLOOKUP(J173,'3.INFRASTRUCTURAS Y SERVICIOS'!I:K,3,FALSE))","v":"no_data"},0,5,0,0,3,0,15,0,{"$f":"ListaCriterios!O173","v":"Crear, impulsar o inscribirse a un servicio de Punto verde industrial"}]
[{"$f":"ListaCriterios!A174","v":3},{"$f":"ListaCriterios!B174","v":"Infrastructuras y servicios"},{"$f":"ListaCriterios!C174","v":"3.3"},{"$f":"ListaCriterios!D174","v":"Servicios avanzados y/o compartidos"},{"$f":"ListaCriterios!E174","v":"3.3.12"},{"$f":"ListaCriterios!F174","v":"Seguridad y emergencias"},{"$f":"ListaCriterios!G174","v":"SEGURIDAD"},{"$f":"ListaCriterios!H174","v":"3.3.12.a"},{"$f":"ListaCriterios!I174","v":"x"},{"$f":"ListaCriterios!J174","v":"¿El área empresarial cuenta con presencia de fuerzas y cuerpos de seguridad o de servicio de vigilancia privada?"},{"$f":"ListaCriterios!K174","v":"SI/NO"},{"$f":"IF(VLOOKUP(J174,'3.INFRASTRUCTURAS Y SERVICIOS'!I:K,3,FALSE)=\"\",\"no_data\",VLOOKUP(J174,'3.INFRASTRUCTURAS Y SERVICIOS'!I:K,3,FALSE))","v":"no_data"},0,5,0,0,3,0,15,0,{"$f":"ListaCriterios!O174","v":"Disponer de un servicio de seguridad y/o vigilancia pública o privada específica por el PAE"}]
[{"$f":"ListaCriterios!A175","v":3},{"$f":"ListaCriterios!B175","v":"Infrastructuras y servicios"},{"$f":"ListaCriterios!C175","v":"3.3"},{"$f":"ListaCriterios!D175","v":"Servicios avanzados y/o compartidos"},{"$f":"ListaCriterios!E175","v":"3.3.12"},{"$f":"ListaCriterios!F175","v":"Seguridad y emergencias"},{"$f":"ListaCriterios!G175","v":"SEGURIDAD"},{"$f":"ListaCriterios!H175","v":"3.3.12.b"},{"$f":"ListaCriterios!I175","v":"x"},{"$f":"ListaCriterios!J175","v":"¿Se ha comunicado el plan de actuación frente a emergencias a empresas del área y terceros potencialmente afectados sobre su contenido? ¿Se tienen evidencias de estas comunicaciones?"},{"$f":"ListaCriterios!K175","v":"Grad 1-5"},{"$f":"IF(VLOOKUP(J175,'3.INFRASTRUCTURAS Y SERVICIOS'!I:K,3,FALSE)=\"\",\"no_data\",VLOOKUP(J175,'3.INFRASTRUCTURAS Y SERVICIOS'!I:K,3,FALSE))","v":"no_data"},0,5,0,0,3,0,15,0,{"$f":"ListaCriterios!O175","v":"Elaborar y mantener un Plan de Emergencias del PAE y realizar las correspondientes comunicaciones a las empresas"}]
[{"$f":"ListaCriterios!A176","v":3},{"$f":"ListaCriterios!B176","v":"Infrastructuras y servicios"},{"$f":"ListaCriterios!C176","v":"3.3"},{"$f":"ListaCriterios!D176","v":"Servicios avanzados y/o compartidos"},{"$f":"ListaCriterios!E176","v":"3.3.12"},{"$f":"ListaCriterios!F176","v":"Seguridad y emergencias"},{"$f":"ListaCriterios!G176","v":"SEGURIDAD"},{"$f":"ListaCriterios!H176","v":"3.3.12.c"},{"$f":"ListaCriterios!I176","v":"x"},{"$f":"ListaCriterios!J176","v":"¿Se han realizado simulacros de puesta en marcha el plan de emergencia en el último año? ¿Se han puesto en marcha las infraestructuras de emergencia? (RECOMENDACIÓN)"},{"$f":"ListaCriterios!K176","v":"SI/NO"},{"$f":"IF(VLOOKUP(J176,'3.INFRASTRUCTURAS Y SERVICIOS'!I:K,3,FALSE)=\"\",\"no_data\",VLOOKUP(J176,'3.INFRASTRUCTURAS Y SERVICIOS'!I:K,3,FALSE))","v":"no_data"},0,5,0,0,3,0,15,0,{"$f":"ListaCriterios!O176","v":"Realizar simulacros de Emergencias tales como seísmos, incendios, inundaciones, emergencia química, etc."}]
[{"$f":"ListaCriterios!A177","v":3},{"$f":"ListaCriterios!B177","v":"Infrastructuras y servicios"},{"$f":"ListaCriterios!C177","v":"3.3"},{"$f":"ListaCriterios!D177","v":"Servicios avanzados y/o compartidos"},{"$f":"ListaCriterios!E177","v":"3.3.12"},{"$f":"ListaCriterios!F177","v":"Seguridad y emergencias"},{"$f":"ListaCriterios!G177","v":"SEGURIDAD"},{"$f":"ListaCriterios!H177","v":"3.3.12.d"},{"$f":"ListaCriterios!I177","v":"x"},{"$f":"ListaCriterios!J177","v":"¿Se tiene un Plan de emergencias en versión actualizada y con los contenidos indicados en el referencial Marca Q?"},{"$f":"ListaCriterios!K177","v":"SI/NO"},{"$f":"IF(VLOOKUP(J177,'3.INFRASTRUCTURAS Y SERVICIOS'!I:K,3,FALSE)=\"\",\"no_data\",VLOOKUP(J177,'3.INFRASTRUCTURAS Y SERVICIOS'!I:K,3,FALSE))","v":"no_data"},0,5,0,0,3,0,15,0,{"$f":"ListaCriterios!O177","v":"Elaborar y mantener un Plan de Emergencias del PAE y realizar las correspondientes comunicaciones a las empresas"}]
[{"$f":"ListaCriterios!A178","v":3},{"$f":"ListaCriterios!B178","v":"Infrastructuras y servicios"},{"$f":"ListaCriterios!C178","v":"3.3"},{"$f":"ListaCriterios!D178","v":"Servicios avanzados y/o compartidos"},{"$f":"ListaCriterios!E178","v":"3.3.12"},{"$f":"ListaCriterios!F178","v":"Seguridad y emergencias"},{"$f":"ListaCriterios!G178","v":"SEGURIDAD"},{"$f":"ListaCriterios!H178","v":"3.3.12.e"},{"$f":"ListaCriterios!I178","v":"x"},{"$f":"ListaCriterios!J178","v":"Grado de coordinación de la vigilancia privada y conocimiento del procedimiento de actuación frente a incidentes"},{"$f":"ListaCriterios!K178","v":"Grad 1-5"},{"$f":"IF(VLOOKUP(J178,'3.INFRASTRUCTURAS Y SERVICIOS'!I:K,3,FALSE)=\"\",\"no_data\",VLOOKUP(J178,'3.INFRASTRUCTURAS Y SERVICIOS'!I:K,3,FALSE))","v":"no_data"},0,5,0,0,3,0,15,0,{"$f":"ListaCriterios!O178","v":"Realizar la correspondiente formación y coordinación con los responsables de la vigilancia privada (en su caso), protección civil, policía local, etc. En relación a posibles emergencias en el PAE"}]
[{"$f":"ListaCriterios!A179","v":3},{"$f":"ListaCriterios!B179","v":"Infrastructuras y servicios"},{"$f":"ListaCriterios!C179","v":"3.3"},{"$f":"ListaCriterios!D179","v":"Servicios avanzados y/o compartidos"},{"$f":"ListaCriterios!E179","v":"3.3.12"},{"$f":"ListaCriterios!F179","v":"Seguridad y emergencias"},{"$f":"ListaCriterios!G179","v":"SEGURIDAD"},{"$f":"ListaCriterios!H179","v":"3.3.12.f"},{"$f":"ListaCriterios!I179","v":"x"},{"$f":"ListaCriterios!J179","v":"Definición clara de responsabilidades en relación con el plan de actuación ante emergencias vigente"},{"$f":"ListaCriterios!K179","v":"SI/NO"},{"$f":"IF(VLOOKUP(J179,'3.INFRASTRUCTURAS Y SERVICIOS'!I:K,3,FALSE)=\"\",\"no_data\",VLOOKUP(J179,'3.INFRASTRUCTURAS Y SERVICIOS'!I:K,3,FALSE))","v":"no_data"},0,5,0,0,3,0,15,0,{"$f":"ListaCriterios!O179","v":"Definir claramente las responsabilidades ante una emergencia en el PAE (normalmente, definidas en el Plan de Emergencia)"}]
[{"$f":"ListaCriterios!A180","v":3},{"$f":"ListaCriterios!B180","v":"Infrastructuras y servicios"},{"$f":"ListaCriterios!C180","v":"3.3"},{"$f":"ListaCriterios!D180","v":"Servicios avanzados y/o compartidos"},{"$f":"ListaCriterios!E180","v":"3.3.12"},{"$f":"ListaCriterios!F180","v":"Seguridad y emergencias"},{"$f":"ListaCriterios!G180","v":"SEGURIDAD"},{"$f":"ListaCriterios!H180","v":"3.3.12.g"},{"$f":"ListaCriterios!I180","v":"x"},{"$f":"ListaCriterios!J180","v":"Grado de funcionamiento y mantenimiento de las instalaciones de vigilancia"},{"$f":"ListaCriterios!K180","v":"Grad 1-5"},{"$f":"IF(VLOOKUP(J180,'3.INFRASTRUCTURAS Y SERVICIOS'!I:K,3,FALSE)=\"\",\"no_data\",VLOOKUP(J180,'3.INFRASTRUCTURAS Y SERVICIOS'!I:K,3,FALSE))","v":"no_data"},0,5,0,0,3,0,15,0,{"$f":"ListaCriterios!O180","v":"Disponer de elementos técnicos para la vigilancia del PAE en buen estado de funcionamiento y mantenimiento (p.ej. pilones por control de tráfico, videovigilancia, iluminación de seguridad, radio…)"}]
[{"$f":"ListaCriterios!A181","v":3},{"$f":"ListaCriterios!B181","v":"Infrastructuras y servicios"},{"$f":"ListaCriterios!C181","v":"3.3"},{"$f":"ListaCriterios!D181","v":"Servicios avanzados y/o compartidos"},{"$f":"ListaCriterios!E181","v":"3.3.12"},{"$f":"ListaCriterios!F181","v":"Seguridad y emergencias"},{"$f":"ListaCriterios!G181","v":"SEGURIDAD"},{"$f":"ListaCriterios!H181","v":"3.3.12.h"},{"$f":"ListaCriterios!I181","v":"x"},{"$f":"ListaCriterios!J181","v":"¿Se realizan simulacros de emergencia con periodicidad adecuada y se analiza la información obtenida para la mejora?"},{"$f":"ListaCriterios!K181","v":"SI/NO"},{"$f":"IF(VLOOKUP(J181,'3.INFRASTRUCTURAS Y SERVICIOS'!I:K,3,FALSE)=\"\",\"no_data\",VLOOKUP(J181,'3.INFRASTRUCTURAS Y SERVICIOS'!I:K,3,FALSE))","v":"no_data"},0,5,0,0,3,0,15,0,{"$f":"ListaCriterios!O181","v":"Realizar simulacros de Emergencias y analizar sus resultados para mejorar el Plan de Emergencia"}]
[{"$f":"ListaCriterios!A182","v":3},{"$f":"ListaCriterios!B182","v":"Infrastructuras y servicios"},{"$f":"ListaCriterios!C182","v":"3.3"},{"$f":"ListaCriterios!D182","v":"Servicios avanzados y/o compartidos"},{"$f":"ListaCriterios!E182","v":"3.3.12"},{"$f":"ListaCriterios!F182","v":"Seguridad y emergencias"},{"$f":"ListaCriterios!G182","v":"SEGURIDAD"},{"$f":"ListaCriterios!H182","v":"3.3.12.i"},{"$f":"ListaCriterios!I182","v":"x"},{"$f":"ListaCriterios!J182","v":"¿Existen un servicio central que centralice la gestión de emergencias en el PAE?"},{"$f":"ListaCriterios!K182","v":"SI/NO"},{"$f":"IF(VLOOKUP(J182,'3.INFRASTRUCTURAS Y SERVICIOS'!I:K,3,FALSE)=\"\",\"no_data\",VLOOKUP(J182,'3.INFRASTRUCTURAS Y SERVICIOS'!I:K,3,FALSE))","v":"no_data"},0,5,0,0,3,0,15,0,{"$f":"ListaCriterios!O182","v":"Disponer de un centro, servicio o responsable que centralice la gestión de emergencias en el PAE"}]
[{"$f":"ListaCriterios!A183","v":3},{"$f":"ListaCriterios!B183","v":"Infrastructuras y servicios"},{"$f":"ListaCriterios!C183","v":"3.4"},{"$f":"ListaCriterios!D183","v":"Servicios básicos"},{"$f":"ListaCriterios!E183","v":"3.4.1"},{"$f":"ListaCriterios!F183","v":"Transporte público"},{"$f":"ListaCriterios!G183","v":"MOVILIDAD"},{"$f":"ListaCriterios!H183","v":"3.4.1.b"},{"$f":"ListaCriterios!I183","v":0},{"$f":"ListaCriterios!J183","v":"Grado de proximidad y competitividad del transporte público (llega, frecuencia, rapidez, competitividad…)"},{"$f":"ListaCriterios!K183","v":"Grad 1-5"},{"$f":"IF(VLOOKUP(J183,'3.INFRASTRUCTURAS Y SERVICIOS'!I:K,3,FALSE)=\"\",\"no_data\",VLOOKUP(J183,'3.INFRASTRUCTURAS Y SERVICIOS'!I:K,3,FALSE))","v":"no_data"},0,5,0,0,2,0,10,0,{"$f":"ListaCriterios!O183","v":0}]
[{"$f":"ListaCriterios!A184","v":3},{"$f":"ListaCriterios!B184","v":"Infrastructuras y servicios"},{"$f":"ListaCriterios!C184","v":"3.4"},{"$f":"ListaCriterios!D184","v":"Servicios básicos"},{"$f":"ListaCriterios!E184","v":"3.4.2"},{"$f":"ListaCriterios!F184","v":"Limpieza vial"},{"$f":"ListaCriterios!G184","v":"CALIDAD DEL ESPACIO"},{"$f":"ListaCriterios!H184","v":"3.4.2.a"},{"$f":"ListaCriterios!I184","v":0},{"$f":"ListaCriterios!J184","v":"¿Se tiene contrato (en caso de corresponder la gestión en el área) con la empresa proveedora del servicio de limpieza?"},{"$f":"ListaCriterios!K184","v":"SI/NO"},{"$f":"IF(VLOOKUP(J184,'3.INFRASTRUCTURAS Y SERVICIOS'!I:K,3,FALSE)=\"\",\"no_data\",VLOOKUP(J184,'3.INFRASTRUCTURAS Y SERVICIOS'!I:K,3,FALSE))","v":"no_data"},0,5,0,0,1,0,5,0,{"$f":"ListaCriterios!O184","v":0}]
[{"$f":"ListaCriterios!A185","v":3},{"$f":"ListaCriterios!B185","v":"Infrastructuras y servicios"},{"$f":"ListaCriterios!C185","v":"3.4"},{"$f":"ListaCriterios!D185","v":"Servicios básicos"},{"$f":"ListaCriterios!E185","v":"3.4.2"},{"$f":"ListaCriterios!F185","v":"Limpieza vial"},{"$f":"ListaCriterios!G185","v":"CALIDAD DEL ESPACIO"},{"$f":"ListaCriterios!H185","v":"3.4.2.b"},{"$f":"ListaCriterios!I185","v":0},{"$f":"ListaCriterios!J185","v":"¿Existen Informes o propuestas de mejora enviadas a concesionario de limpieza, si las hubiere?"},{"$f":"ListaCriterios!K185","v":"SI/NO"},{"$f":"IF(VLOOKUP(J185,'3.INFRASTRUCTURAS Y SERVICIOS'!I:K,3,FALSE)=\"\",\"no_data\",VLOOKUP(J185,'3.INFRASTRUCTURAS Y SERVICIOS'!I:K,3,FALSE))","v":"no_data"},0,5,0,0,1,0,5,0,{"$f":"ListaCriterios!O185","v":0}]
[{"$f":"ListaCriterios!A186","v":3},{"$f":"ListaCriterios!B186","v":"Infrastructuras y servicios"},{"$f":"ListaCriterios!C186","v":"3.4"},{"$f":"ListaCriterios!D186","v":"Servicios básicos"},{"$f":"ListaCriterios!E186","v":"3.4.2"},{"$f":"ListaCriterios!F186","v":"Limpieza vial"},{"$f":"ListaCriterios!G186","v":"CALIDAD DEL ESPACIO"},{"$f":"ListaCriterios!H186","v":"3.4.2.c"},{"$f":"ListaCriterios!I186","v":0},{"$f":"ListaCriterios!J186","v":"Grado de conservación de las zonas verdes dentro del área empresarial"},{"$f":"ListaCriterios!K186","v":"Grad 1-5"},{"$f":"IF(VLOOKUP(J186,'3.INFRASTRUCTURAS Y SERVICIOS'!I:K,3,FALSE)=\"\",\"no_data\",VLOOKUP(J186,'3.INFRASTRUCTURAS Y SERVICIOS'!I:K,3,FALSE))","v":"no_data"},0,5,0,0,1,0,5,0,{"$f":"ListaCriterios!O186","v":0}]
[{"$f":"ListaCriterios!A187","v":3},{"$f":"ListaCriterios!B187","v":"Infrastructuras y servicios"},{"$f":"ListaCriterios!C187","v":"3.4"},{"$f":"ListaCriterios!D187","v":"Servicios básicos"},{"$f":"ListaCriterios!E187","v":"3.4.2"},{"$f":"ListaCriterios!F187","v":"Limpieza vial"},{"$f":"ListaCriterios!G187","v":"CALIDAD DEL ESPACIO"},{"$f":"ListaCriterios!H187","v":"3.4.2.d"},{"$f":"ListaCriterios!I187","v":0},{"$f":"ListaCriterios!J187","v":"Grado de limpieza del espacio público del área empresarial"},{"$f":"ListaCriterios!K187","v":"Grad 1-5"},{"$f":"IF(VLOOKUP(J187,'3.INFRASTRUCTURAS Y SERVICIOS'!I:K,3,FALSE)=\"\",\"no_data\",VLOOKUP(J187,'3.INFRASTRUCTURAS Y SERVICIOS'!I:K,3,FALSE))","v":"no_data"},0,5,0,0,1,0,5,0,{"$f":"ListaCriterios!O187","v":0}]
[{"$f":"ListaCriterios!A188","v":3},{"$f":"ListaCriterios!B188","v":"Infrastructuras y servicios"},{"$f":"ListaCriterios!C188","v":"3.4"},{"$f":"ListaCriterios!D188","v":"Servicios básicos"},{"$f":"ListaCriterios!E188","v":"3.4.2"},{"$f":"ListaCriterios!F188","v":"Limpieza vial"},{"$f":"ListaCriterios!G188","v":"CALIDAD DEL ESPACIO"},{"$f":"ListaCriterios!H188","v":"3.4.2.e"},{"$f":"ListaCriterios!I188","v":0},{"$f":"ListaCriterios!J188","v":"¿Los períodos de prestación de servicio son adecuados a la tipología del área ya las necesidades de las empresas?"},{"$f":"ListaCriterios!K188","v":"SI/NO"},{"$f":"IF(VLOOKUP(J188,'3.INFRASTRUCTURAS Y SERVICIOS'!I:K,3,FALSE)=\"\",\"no_data\",VLOOKUP(J188,'3.INFRASTRUCTURAS Y SERVICIOS'!I:K,3,FALSE))","v":"no_data"},0,5,0,0,1,0,5,0,{"$f":"ListaCriterios!O188","v":0}]
[{"$f":"ListaCriterios!A189","v":4},{"$f":"ListaCriterios!B189","v":"Integración ambiental y riesgos"},{"$f":"ListaCriterios!C189","v":"4.1"},{"$f":"ListaCriterios!D189","v":"Contaminación luminosa"},{"$f":"ListaCriterios!E189","v":"4.1.1"},{"$f":"ListaCriterios!F189","v":"Alumbrado adaptado"},{"$f":"ListaCriterios!G189","v":"CALIDAD DEL ESPACIO"},{"$f":"ListaCriterios!H189","v":"4.1.1.a"},{"$f":"ListaCriterios!I189","v":0},{"$f":"ListaCriterios!J189","v":"Proporción de alumbrado adpatado a normativa (%)"},{"$f":"ListaCriterios!K189","v":"Grad 1-5"},{"$f":"IF(VLOOKUP(J189,'4.INTEGR AMBIENTAL Y RIESGOS'!I:K,3,FALSE)=\"\",\"no_data\",VLOOKUP(J189,'4.INTEGR AMBIENTAL Y RIESGOS'!I:K,3,FALSE))","v":"no_data"},0,5,0,0,2,0,10,0,{"$f":"ListaCriterios!O189","v":0}]
[{"$f":"ListaCriterios!A190","v":4},{"$f":"ListaCriterios!B190","v":"Integración ambiental y riesgos"},{"$f":"ListaCriterios!C190","v":"4.1"},{"$f":"ListaCriterios!D190","v":"Contaminación luminosa"},{"$f":"ListaCriterios!E190","v":"4.1.1"},{"$f":"ListaCriterios!F190","v":"Alumbrado adaptado"},{"$f":"ListaCriterios!G190","v":"CALIDAD DEL ESPACIO"},{"$f":"ListaCriterios!H190","v":"4.1.1.b"},{"$f":"ListaCriterios!I190","v":0},{"$f":"ListaCriterios!J190","v":"¿Existe mapa de protección frente a la contaminación luminosa (zonas E1, E2, E3, E4) disponible y actualizado?"},{"$f":"ListaCriterios!K190","v":"SI/NO"},{"$f":"IF(VLOOKUP(J190,'4.INTEGR AMBIENTAL Y RIESGOS'!I:K,3,FALSE)=\"\",\"no_data\",VLOOKUP(J190,'4.INTEGR AMBIENTAL Y RIESGOS'!I:K,3,FALSE))","v":"no_data"},0,5,0,0,2,0,10,0,{"$f":"ListaCriterios!O190","v":0}]
[{"$f":"ListaCriterios!A191","v":4},{"$f":"ListaCriterios!B191","v":"Integración ambiental y riesgos"},{"$f":"ListaCriterios!C191","v":"4.2"},{"$f":"ListaCriterios!D191","v":"Emisiones atmosféricas"},{"$f":"ListaCriterios!E191","v":"4.2.1"},{"$f":"ListaCriterios!F191","v":"Control de emisiones atmosféricas"},{"$f":"ListaCriterios!G191","v":"ENERGÍA Y CAMBIO CLIMATIC"},{"$f":"ListaCriterios!H191","v":"4.2.1.b"},{"$f":"ListaCriterios!I191","v":"x"},{"$f":"ListaCriterios!J191","v":"¿Existe estación de medida de inmisión de contaminantes atmosféricos?"},{"$f":"ListaCriterios!K191","v":"SI/NO"},{"$f":"IF(VLOOKUP(J191,'4.INTEGR AMBIENTAL Y RIESGOS'!I:K,3,FALSE)=\"\",\"no_data\",VLOOKUP(J191,'4.INTEGR AMBIENTAL Y RIESGOS'!I:K,3,FALSE))","v":"no_data"},0,5,0,0,3,0,15,0,{"$f":"ListaCriterios!O191","v":"Disponer de una estación de medida de inmisión de contaminantes atmosféricos (CO, PM10, Nox, SO2, etc)"}]
[{"$f":"ListaCriterios!A192","v":4},{"$f":"ListaCriterios!B192","v":"Integración ambiental y riesgos"},{"$f":"ListaCriterios!C192","v":"4.2"},{"$f":"ListaCriterios!D192","v":"Emisiones atmosféricas"},{"$f":"ListaCriterios!E192","v":"4.2.2"},{"$f":"ListaCriterios!F192","v":"Calidad del aire"},{"$f":"ListaCriterios!G192","v":"ENERGÍA Y CAMBIO CLIMATIC"},{"$f":"ListaCriterios!H192","v":"4.2.2.c"},{"$f":"ListaCriterios!I192","v":"x"},{"$f":"ListaCriterios!J192","v":"¿Existe información de proximidad disponible sobre sobre calidad del aire: PST, NO2, CO, O3?"},{"$f":"ListaCriterios!K192","v":"SI/NO"},{"$f":"IF(VLOOKUP(J192,'4.INTEGR AMBIENTAL Y RIESGOS'!I:K,3,FALSE)=\"\",\"no_data\",VLOOKUP(J192,'4.INTEGR AMBIENTAL Y RIESGOS'!I:K,3,FALSE))","v":"no_data"},0,5,0,0,3,0,15,0,{"$f":"ListaCriterios!O192","v":"Disponer de información sobre la calidad del aire, a partir de una estación de medida en el PAE o en sus proximidades"}]
[{"$f":"ListaCriterios!A193","v":4},{"$f":"ListaCriterios!B193","v":"Integración ambiental y riesgos"},{"$f":"ListaCriterios!C193","v":"4.3"},{"$f":"ListaCriterios!D193","v":"Inundabilidad"},{"$f":"ListaCriterios!E193","v":"4.3.1"},{"$f":"ListaCriterios!F193","v":"Afectación por zonas inundables"},{"$f":"ListaCriterios!G193","v":"SEGURIDAD"},{"$f":"ListaCriterios!H193","v":"4.3.1.a"},{"$f":"ListaCriterios!I193","v":0},{"$f":"ListaCriterios!J193","v":"Proporción de superficie del PAE afectada por riesgo de inundación"},{"$f":"ListaCriterios!K193","v":"Grad 1-5"},{"$f":"IF(VLOOKUP(J193,'4.INTEGR AMBIENTAL Y RIESGOS'!I:K,3,FALSE)=\"\",\"no_data\",VLOOKUP(J193,'4.INTEGR AMBIENTAL Y RIESGOS'!I:K,3,FALSE))","v":"no_data"},0,5,0,0,1,0,5,0,{"$f":"ListaCriterios!O193","v":0}]
[{"$f":"ListaCriterios!A194","v":4},{"$f":"ListaCriterios!B194","v":"Integración ambiental y riesgos"},{"$f":"ListaCriterios!C194","v":"4.3"},{"$f":"ListaCriterios!D194","v":"Inundabilidad"},{"$f":"ListaCriterios!E194","v":"4.3.2"},{"$f":"ListaCriterios!F194","v":"Afectación por zonas inundables"},{"$f":"ListaCriterios!G194","v":"SEGURIDAD"},{"$f":"ListaCriterios!H194","v":"4.3.2.b"},{"$f":"ListaCriterios!I194","v":0},{"$f":"ListaCriterios!J194","v":"Grado de adecuación de los elementos de protección contra inundaciones"},{"$f":"ListaCriterios!K194","v":"Grad 1-5"},{"$f":"IF(VLOOKUP(J194,'4.INTEGR AMBIENTAL Y RIESGOS'!I:K,3,FALSE)=\"\",\"no_data\",VLOOKUP(J194,'4.INTEGR AMBIENTAL Y RIESGOS'!I:K,3,FALSE))","v":"no_data"},{"$f":"IF(L194=\"no_data\",0,(IF(K194=\"SI/NO\",IF(L194=\"Sí\",N194,IF(L194=\"No\",O194,P194)),L194)))","v":0},5,0,0,1,0,5,0,{"$f":"ListaCriterios!O194","v":0}]
[{"$f":"ListaCriterios!A195","v":4},{"$f":"ListaCriterios!B195","v":"Integración ambiental y riesgos"},{"$f":"ListaCriterios!C195","v":"4.4"},{"$f":"ListaCriterios!D195","v":"Medio natural"},{"$f":"ListaCriterios!E195","v":"4.4.1"},{"$f":"ListaCriterios!F195","v":"Integración en el entorno natural"},{"$f":"ListaCriterios!G195","v":"CALIDAD DEL ESPACIO"},{"$f":"ListaCriterios!H195","v":"4.4.1.a"},{"$f":"ListaCriterios!I195","v":"x"},{"$f":"ListaCriterios!J195","v":"¿Se ha realizado un estudio de necesidad de pases de fauna? En caso de existir o ser necesarios, ¿son adecuados?"},{"$f":"ListaCriterios!K195","v":"SI/NO"},{"$f":"IF(VLOOKUP(J195,'4.INTEGR AMBIENTAL Y RIESGOS'!I:K,3,FALSE)=\"\",\"no_data\",VLOOKUP(J195,'4.INTEGR AMBIENTAL Y RIESGOS'!I:K,3,FALSE))","v":"no_data"},0,5,0,0,3,{"$f":"M195*Q195","v":0},{"$f":"Q195*5","v":15},{"$f":"M195/S195","v":0},{"$f":"ListaCriterios!O195","v":"Evaluar y la necesidad y, en su caso, crear pasos de fauna para garantizar la conectividad ecológica"}]
[{"$f":"ListaCriterios!A196","v":4},{"$f":"ListaCriterios!B196","v":"Integración ambiental y riesgos"},{"$f":"ListaCriterios!C196","v":"4.4"},{"$f":"ListaCriterios!D196","v":"Medio natural"},{"$f":"ListaCriterios!E196","v":"4.4.1"},{"$f":"ListaCriterios!F196","v":"Integración en el entorno natural"},{"$f":"ListaCriterios!G196","v":"SEGURIDAD"},{"$f":"ListaCriterios!H196","v":"4.4.1.b"},{"$f":"ListaCriterios!I196","v":"x"},{"$f":"ListaCriterios!J196","v":"¿Se mantiene el control de perimetros de protección/franjas por control riesgo incendio forestal?"},{"$f":"ListaCriterios!K196","v":"SI/NO"},{"$f":"IF(VLOOKUP(J196,'4.INTEGR AMBIENTAL Y RIESGOS'!I:K,3,FALSE)=\"\",\"no_data\",VLOOKUP(J196,'4.INTEGR AMBIENTAL Y RIESGOS'!I:K,3,FALSE))","v":"no_data"},0,5,0,0,3,0,15,0,{"$f":"ListaCriterios!O196","v":"Mantenimiento de los perimetros de protección/franjas por control riesgo incendio forestal"}]
[{"$f":"ListaCriterios!A197","v":4},{"$f":"ListaCriterios!B197","v":"Integración ambiental y riesgos"},{"$f":"ListaCriterios!C197","v":"4.4"},{"$f":"ListaCriterios!D197","v":"Medio natural"},{"$f":"ListaCriterios!E197","v":"4.4.1"},{"$f":"ListaCriterios!F197","v":"Integración en el entorno natural"},{"$f":"ListaCriterios!G197","v":"CALIDAD DEL ESPACIO"},{"$f":"ListaCriterios!H197","v":"4.4.1.c"},{"$f":"ListaCriterios!I197","v":"x"},{"$f":"ListaCriterios!J197","v":"¿Se han realizado estudios de afectación en la fauna?"},{"$f":"ListaCriterios!K197","v":"SI/NO"},{"$f":"IF(VLOOKUP(J197,'4.INTEGR AMBIENTAL Y RIESGOS'!I:K,3,FALSE)=\"\",\"no_data\",VLOOKUP(J197,'4.INTEGR AMBIENTAL Y RIESGOS'!I:K,3,FALSE))","v":"no_data"},0,5,0,0,3,0,15,0,{"$f":"ListaCriterios!O197","v":"En el caso de PAE no delimitados por trama urbana, disponer de información y/o estudios sobre posibles afectaciones a la fauna por la circulación de vehículos, emnisiones atmosféricas, ruidos o contaminación luminosa"}]
[{"$f":"ListaCriterios!A198","v":4},{"$f":"ListaCriterios!B198","v":"Integración ambiental y riesgos"},{"$f":"ListaCriterios!C198","v":"4.4"},{"$f":"ListaCriterios!D198","v":"Medio natural"},{"$f":"ListaCriterios!E198","v":"4.4.1"},{"$f":"ListaCriterios!F198","v":"Integración en el entorno natural"},{"$f":"ListaCriterios!G198","v":"CALIDAD DEL ESPACIO"},{"$f":"ListaCriterios!H198","v":"4.4.1.d"},{"$f":"ListaCriterios!I198","v":"x"},{"$f":"ListaCriterios!J198","v":"¿Existen, en caso de ser necesarias, medidas de protección en fauna (aves nidificantes, protección de zonas especiales, control de ruido, control iluminación, etc.)?"},{"$f":"ListaCriterios!K198","v":"SI/NO"},{"$f":"IF(VLOOKUP(J198,'4.INTEGR AMBIENTAL Y RIESGOS'!I:K,3,FALSE)=\"\",\"no_data\",VLOOKUP(J198,'4.INTEGR AMBIENTAL Y RIESGOS'!I:K,3,FALSE))","v":"no_data"},0,5,0,0,3,0,15,0,{"$f":"ListaCriterios!O198","v":"En caso de ser consideradas necesarias en estudios previos, crear medidas de protección en fauna (aves nidificantes, protección de zonas especiales, control de ruido, control iluminación, etc.)"}]
[{"$f":"ListaCriterios!A199","v":4},{"$f":"ListaCriterios!B199","v":"Integración ambiental y riesgos"},{"$f":"ListaCriterios!C199","v":"4.5"},{"$f":"ListaCriterios!D199","v":"Paisaje"},{"$f":"ListaCriterios!E199","v":"4.5.1"},{"$f":"ListaCriterios!F199","v":"Grado de calidad del paisaje e integración del PAE"},{"$f":"ListaCriterios!G199","v":"CALIDAD DEL ESPACIO"},{"$f":"ListaCriterios!H199","v":"4.5.1.a"},{"$f":"ListaCriterios!I199","v":"x"},{"$f":"ListaCriterios!J199","v":"Grado de integración del PAE en el paisaje"},{"$f":"ListaCriterios!K199","v":"Grad 1-5"},{"$f":"IF(VLOOKUP(J199,'4.INTEGR AMBIENTAL Y RIESGOS'!I:K,3,FALSE)=\"\",\"no_data\",VLOOKUP(J199,'4.INTEGR AMBIENTAL Y RIESGOS'!I:K,3,FALSE))","v":"no_data"},0,5,0,0,3,0,15,0,{"$f":"ListaCriterios!O199","v":"Realizar acciones para fomentar la integración paisajística de las construcciones y la morfología general del PAE en el paisaje"}]
[{"$f":"ListaCriterios!A200","v":4},{"$f":"ListaCriterios!B200","v":"Integración ambiental y riesgos"},{"$f":"ListaCriterios!C200","v":"4.5"},{"$f":"ListaCriterios!D200","v":"Paisaje"},{"$f":"ListaCriterios!E200","v":"4.5.1"},{"$f":"ListaCriterios!F200","v":"Grado de calidad del paisaje e integración del PAE"},{"$f":"ListaCriterios!G200","v":"CALIDAD DEL ESPACIO"},{"$f":"ListaCriterios!H200","v":"4.5.1.b"},{"$f":"ListaCriterios!I200","v":"x"},{"$f":"ListaCriterios!J200","v":"¿Nivel de adecuación del PAE para permitir el disfrute del paisaje?"},{"$f":"ListaCriterios!K200","v":"Grad 1-5"},{"$f":"IF(VLOOKUP(J200,'4.INTEGR AMBIENTAL Y RIESGOS'!I:K,3,FALSE)=\"\",\"no_data\",VLOOKUP(J200,'4.INTEGR AMBIENTAL Y RIESGOS'!I:K,3,FALSE))","v":"no_data"},0,5,0,0,3,0,15,0,{"$f":"ListaCriterios!O200","v":"Realizar acciones para fomentar que las personas dentro del entorno del PAE tengan una buena percepción del paisaje (acciones como ajardinamiento, eliminación de zonas banales, permitir visuales en el paisaje del entorno, miradores, etc)"}]
[{"$f":"ListaCriterios!A201","v":4},{"$f":"ListaCriterios!B201","v":"Integración ambiental y riesgos"},{"$f":"ListaCriterios!C201","v":"4.5"},{"$f":"ListaCriterios!D201","v":"Paisaje"},{"$f":"ListaCriterios!E201","v":"4.5.1"},{"$f":"ListaCriterios!F201","v":"Grado de calidad del paisaje e integración del PAE"},{"$f":"ListaCriterios!G201","v":"CALIDAD DEL ESPACIO"},{"$f":"ListaCriterios!H201","v":"4.5.1.c"},{"$f":"ListaCriterios!I201","v":"x"},{"$f":"ListaCriterios!J201","v":"¿Se dispone de información sobre el Patrimonio industrial/cultural, de sus valores y las necesidades de preservación (en su caso)?"},{"$f":"ListaCriterios!K201","v":"SI/NO"},{"$f":"IF(VLOOKUP(J201,'4.INTEGR AMBIENTAL Y RIESGOS'!I:K,3,FALSE)=\"\",\"no_data\",VLOOKUP(J201,'4.INTEGR AMBIENTAL Y RIESGOS'!I:K,3,FALSE))","v":"no_data"},0,5,0,0,3,0,15,0,{"$f":"ListaCriterios!O201","v":"Disponer de información sobre la existencia de Patrimonio Industrial o Cultural y, en caso de que exista, disponer de información sobre sus necesidades de preservación y/o recuperación"}]
[{"$f":"ListaCriterios!A202","v":4},{"$f":"ListaCriterios!B202","v":"Integración ambiental y riesgos"},{"$f":"ListaCriterios!C202","v":"4.5"},{"$f":"ListaCriterios!D202","v":"Paisaje"},{"$f":"ListaCriterios!E202","v":"4.5.1"},{"$f":"ListaCriterios!F202","v":"Grado de calidad del paisaje e integración del PAE"},{"$f":"ListaCriterios!G202","v":"CALIDAD DEL ESPACIO"},{"$f":"ListaCriterios!H202","v":"4.5.1.d"},{"$f":"ListaCriterios!I202","v":0},{"$f":"ListaCriterios!J202","v":"¿Se ha realizado alguna gestión por el mantenimiento del patrimonio industrial/cultural?"},{"$f":"ListaCriterios!K202","v":"SI/NO"},{"$f":"IF(VLOOKUP(J202,'4.INTEGR AMBIENTAL Y RIESGOS'!I:K,3,FALSE)=\"\",\"no_data\",VLOOKUP(J202,'4.INTEGR AMBIENTAL Y RIESGOS'!I:K,3,FALSE))","v":"no_data"},0,5,0,0,2,0,10,0,{"$f":"ListaCriterios!O202","v":0}]
[{"$f":"ListaCriterios!A203","v":4},{"$f":"ListaCriterios!B203","v":"Integración ambiental y riesgos"},{"$f":"ListaCriterios!C203","v":"4.6"},{"$f":"ListaCriterios!D203","v":"Ruido"},{"$f":"ListaCriterios!E203","v":"4.6.1"},{"$f":"ListaCriterios!F203","v":"Protección contra el ruido"},{"$f":"ListaCriterios!G203","v":"CALIDAD DEL ESPACIO"},{"$f":"ListaCriterios!H203","v":"4.6.1.a"},{"$f":"ListaCriterios!I203","v":0},{"$f":"ListaCriterios!J203","v":"¿Existe mapa de zonificación acústica actualizado y disponible?"},{"$f":"ListaCriterios!K203","v":"SI/NO"},{"$f":"IF(VLOOKUP(J203,'4.INTEGR AMBIENTAL Y RIESGOS'!I:K,3,FALSE)=\"\",\"no_data\",VLOOKUP(J203,'4.INTEGR AMBIENTAL Y RIESGOS'!I:K,3,FALSE))","v":"no_data"},0,5,0,0,2,0,10,0,{"$f":"ListaCriterios!O203","v":0}]
[{"$f":"ListaCriterios!A204","v":4},{"$f":"ListaCriterios!B204","v":"Integración ambiental y riesgos"},{"$f":"ListaCriterios!C204","v":"4.6"},{"$f":"ListaCriterios!D204","v":"Ruido"},{"$f":"ListaCriterios!E204","v":"4.6.1"},{"$f":"ListaCriterios!F204","v":"Protección contra el ruido"},{"$f":"ListaCriterios!G204","v":"CALIDAD DEL ESPACIO"},{"$f":"ListaCriterios!H204","v":"4.6.1.b"},{"$f":"ListaCriterios!I204","v":0},{"$f":"ListaCriterios!J204","v":"En caso necesario, ¿existen pantallas acústicas o similares para la protección contra el ruido?"},{"$f":"ListaCriterios!K204","v":"SI/NO"},{"$f":"IF(VLOOKUP(J204,'4.INTEGR AMBIENTAL Y RIESGOS'!I:K,3,FALSE)=\"\",\"no_data\",VLOOKUP(J204,'4.INTEGR AMBIENTAL Y RIESGOS'!I:K,3,FALSE))","v":"no_data"},0,5,0,0,2,0,10,0,{"$f":"ListaCriterios!O204","v":0}]
[{"$f":"ListaCriterios!A205","v":4},{"$f":"ListaCriterios!B205","v":"Integración ambiental y riesgos"},{"$f":"ListaCriterios!C205","v":"4.6"},{"$f":"ListaCriterios!D205","v":"Ruido"},{"$f":"ListaCriterios!E205","v":"4.6.1"},{"$f":"ListaCriterios!F205","v":"Protección contra el ruido"},{"$f":"ListaCriterios!G205","v":"CALIDAD DEL ESPACIO"},{"$f":"ListaCriterios!H205","v":"4.6.1.c"},{"$f":"ListaCriterios!I205","v":"x"},{"$f":"ListaCriterios!J205","v":"¿La vialidad está construida con asfalto sonorreductor o medidas equivalentes?"},{"$f":"ListaCriterios!K205","v":"SI/NO"},{"$f":"IF(VLOOKUP(J205,'4.INTEGR AMBIENTAL Y RIESGOS'!I:K,3,FALSE)=\"\",\"no_data\",VLOOKUP(J205,'4.INTEGR AMBIENTAL Y RIESGOS'!I:K,3,FALSE))","v":"no_data"},0,5,0,0,3,0,15,0,{"$f":"ListaCriterios!O205","v":"Nuevos carreras y carreteras y reparaciones con materiales sonoreductores o medidas similares"}]
[{"$f":"ListaCriterios!A206","v":4},{"$f":"ListaCriterios!B206","v":"Integración ambiental y riesgos"},{"$f":"ListaCriterios!C206","v":"4.6"},{"$f":"ListaCriterios!D206","v":"Ruido"},{"$f":"ListaCriterios!E206","v":"4.6.1"},{"$f":"ListaCriterios!F206","v":"Protección contra el ruido"},{"$f":"ListaCriterios!G206","v":"CALIDAD DEL ESPACIO"},{"$f":"ListaCriterios!H206","v":"4.6.1.d"},{"$f":"ListaCriterios!I206","v":"x"},{"$f":"ListaCriterios!J206","v":"¿Se realizan controles de ruido o existe algún tipo de servicio por su control?"},{"$f":"ListaCriterios!K206","v":"SI/NO"},{"$f":"IF(VLOOKUP(J206,'4.INTEGR AMBIENTAL Y RIESGOS'!I:K,3,FALSE)=\"\",\"no_data\",VLOOKUP(J206,'4.INTEGR AMBIENTAL Y RIESGOS'!I:K,3,FALSE))","v":"no_data"},0,5,0,0,3,0,15,0,{"$f":"ListaCriterios!O206","v":"Realizar acciones de medida del ruido (inmisión) y/o crear o poder acceder a un servicio para su control de acuerdo a la legislación."}]
[{"$f":"ListaCriterios!A207","v":5},{"$f":"ListaCriterios!B207","v":"Urbanismo"},{"$f":"ListaCriterios!C207","v":"5.1"},{"$f":"ListaCriterios!D207","v":"Características de las parcelas"},{"$f":"ListaCriterios!E207","v":"5.1.1"},{"$f":"ListaCriterios!F207","v":"Grado de ocupación de los PAE"},{"$f":"ListaCriterios!G207","v":"SUELO"},{"$f":"ListaCriterios!H207","v":"5.1.1.a"},{"$f":"ListaCriterios!I207","v":0},{"$f":"ListaCriterios!J207","v":"Grado de ocupación de los PAE (%)"},{"$f":"ListaCriterios!K207","v":"Grad 1-5"},{"$f":"IF(VLOOKUP(J207,'5.URBANISMO'!I:K,3,FALSE)=\"\",\"no_data\",VLOOKUP(J207,'5.URBANISMO'!I:K,3,FALSE))","v":"no_data"},0,5,0,0,1,0,5,0,{"$f":"ListaCriterios!O207","v":0}]
[{"$f":"ListaCriterios!A208","v":5},{"$f":"ListaCriterios!B208","v":"Urbanismo"},{"$f":"ListaCriterios!C208","v":"5.1"},{"$f":"ListaCriterios!D208","v":"Características de las parcelas"},{"$f":"ListaCriterios!E208","v":"5.1.2"},{"$f":"ListaCriterios!F208","v":"Titularidad de las parcelas vacantes y grado de comercialización"},{"$f":"ListaCriterios!G208","v":"SUELO"},{"$f":"ListaCriterios!H208","v":"5.1.2.a"},{"$f":"ListaCriterios!I208","v":0},{"$f":"ListaCriterios!J208","v":"Titularidad del parque. vacantes y grado de comercialización"},{"$f":"ListaCriterios!K208","v":"Grad 1-5"},{"$f":"IF(VLOOKUP(J208,'5.URBANISMO'!I:K,3,FALSE)=\"\",\"no_data\",VLOOKUP(J208,'5.URBANISMO'!I:K,3,FALSE))","v":"no_data"},0,5,0,0,1,0,5,0,{"$f":"ListaCriterios!O208","v":0}]
[{"$f":"ListaCriterios!A209","v":5},{"$f":"ListaCriterios!B209","v":"Urbanismo"},{"$f":"ListaCriterios!C209","v":"5.1"},{"$f":"ListaCriterios!D209","v":"Características de las parcelas"},{"$f":"ListaCriterios!E209","v":"5.1.3"},{"$f":"ListaCriterios!F209","v":"Tipología de las parcelas"},{"$f":"ListaCriterios!G209","v":"SUELO"},{"$f":"ListaCriterios!H209","v":"5.1.3.a"},{"$f":"ListaCriterios!I209","v":0},{"$f":"ListaCriterios!J209","v":"Tipología de las parcelas según dimensiones (variabilidad, disponibilidad y flexibilidad de modificación)"},{"$f":"ListaCriterios!K209","v":"Grad 1-5"},{"$f":"IF(VLOOKUP(J209,'5.URBANISMO'!I:K,3,FALSE)=\"\",\"no_data\",VLOOKUP(J209,'5.URBANISMO'!I:K,3,FALSE))","v":"no_data"},0,5,0,0,1,0,5,0,{"$f":"ListaCriterios!O209","v":0}]
[{"$f":"ListaCriterios!A210","v":5},{"$f":"ListaCriterios!B210","v":"Urbanismo"},{"$f":"ListaCriterios!C210","v":"5.1"},{"$f":"ListaCriterios!D210","v":"Características de las parcelas"},{"$f":"ListaCriterios!E210","v":"5.1.4"},{"$f":"ListaCriterios!F210","v":"Capacidad de expansión de implantaciones actuales"},{"$f":"ListaCriterios!G210","v":"SUELO"},{"$f":"ListaCriterios!H210","v":"5.1.4.a"},{"$f":"ListaCriterios!I210","v":0},{"$f":"ListaCriterios!J210","v":"Capacidad de expansión de las actividades actuales"},{"$f":"ListaCriterios!K210","v":"Grad 1-5"},{"$f":"IF(VLOOKUP(J210,'5.URBANISMO'!I:K,3,FALSE)=\"\",\"no_data\",VLOOKUP(J210,'5.URBANISMO'!I:K,3,FALSE))","v":"no_data"},0,5,0,0,1,0,5,0,{"$f":"ListaCriterios!O210","v":0}]
[{"$f":"ListaCriterios!A211","v":5},{"$f":"ListaCriterios!B211","v":"Urbanismo"},{"$f":"ListaCriterios!C211","v":"5.1"},{"$f":"ListaCriterios!D211","v":"Características de las parcelas"},{"$f":"ListaCriterios!E211","v":"5.1.5"},{"$f":"ListaCriterios!F211","v":"Tipología de las edificaciones"},{"$f":"ListaCriterios!G211","v":"SUELO"},{"$f":"ListaCriterios!H211","v":"5.1.5.a"},{"$f":"ListaCriterios!I211","v":0},{"$f":"ListaCriterios!J211","v":"Edad promedio de las edificaciones actuales y necesidad de renovación"},{"$f":"ListaCriterios!K211","v":"Grad 1-5"},{"$f":"IF(VLOOKUP(J211,'5.URBANISMO'!I:K,3,FALSE)=\"\",\"no_data\",VLOOKUP(J211,'5.URBANISMO'!I:K,3,FALSE))","v":"no_data"},0,5,0,0,1,0,5,0,{"$f":"ListaCriterios!O211","v":0}]
[{"$f":"ListaCriterios!A212","v":5},{"$f":"ListaCriterios!B212","v":"Urbanismo"},{"$f":"ListaCriterios!C212","v":"5.2"},{"$f":"ListaCriterios!D212","v":"Emplazamiento"},{"$f":"ListaCriterios!E212","v":"5.2.1"},{"$f":"ListaCriterios!F212","v":"Acceso desde Áreas Residenciales"},{"$f":"ListaCriterios!G212","v":"MOVILIDAD"},{"$f":"ListaCriterios!H212","v":"5.2.1.a"},{"$f":"ListaCriterios!I212","v":0},{"$f":"ListaCriterios!J212","v":"Grado de proximidad a Áreas Residenciales"},{"$f":"ListaCriterios!K212","v":"Grad 1-5"},{"$f":"IF(VLOOKUP(J212,'5.URBANISMO'!I:K,3,FALSE)=\"\",\"no_data\",VLOOKUP(J212,'5.URBANISMO'!I:K,3,FALSE))","v":"no_data"},0,5,0,0,1,0,5,0,{"$f":"ListaCriterios!O212","v":0}]
[{"$f":"ListaCriterios!A213","v":5},{"$f":"ListaCriterios!B213","v":"Urbanismo"},{"$f":"ListaCriterios!C213","v":"5.2"},{"$f":"ListaCriterios!D213","v":"Emplazamiento"},{"$f":"ListaCriterios!E213","v":"5.2.1"},{"$f":"ListaCriterios!F213","v":"Acceso desde Áreas Industriales"},{"$f":"ListaCriterios!G213","v":"MOVILIDAD"},{"$f":"ListaCriterios!H213","v":"5.2.1.b"},{"$f":"ListaCriterios!I213","v":0},{"$f":"ListaCriterios!J213","v":"Grado de proximidad a otras áreas industriales"},{"$f":"ListaCriterios!K213","v":"Grad 1-5"},{"$f":"IF(VLOOKUP(J213,'5.URBANISMO'!I:K,3,FALSE)=\"\",\"no_data\",VLOOKUP(J213,'5.URBANISMO'!I:K,3,FALSE))","v":"no_data"},0,5,0,0,1,0,5,0,{"$f":"ListaCriterios!O213","v":0}]
[{"$f":"ListaCriterios!A214","v":5},{"$f":"ListaCriterios!B214","v":"Urbanismo"},{"$f":"ListaCriterios!C214","v":"5.2"},{"$f":"ListaCriterios!D214","v":"Emplazamiento"},{"$f":"ListaCriterios!E214","v":"5.2.2"},{"$f":"ListaCriterios!F214","v":"Estado favorable de la tramitación urbanística"},{"$f":"ListaCriterios!G214","v":"SUELO"},{"$f":"ListaCriterios!H214","v":"5.2.2.a"},{"$f":"ListaCriterios!I214","v":0},{"$f":"ListaCriterios!J214","v":"Estado del planeamiento y su tramitación"},{"$f":"ListaCriterios!K214","v":"Grad 1-5"},{"$f":"IF(VLOOKUP(J214,'5.URBANISMO'!I:K,3,FALSE)=\"\",\"no_data\",VLOOKUP(J214,'5.URBANISMO'!I:K,3,FALSE))","v":"no_data"},0,5,0,0,1,0,5,0,{"$f":"ListaCriterios!O214","v":0}]
[{"$f":"ListaCriterios!A215","v":5},{"$f":"ListaCriterios!B215","v":"Urbanismo"},{"$f":"ListaCriterios!C215","v":"5.2"},{"$f":"ListaCriterios!D215","v":"Emplazamiento"},{"$f":"ListaCriterios!E215","v":"5.2.3"},{"$f":"ListaCriterios!F215","v":"Capacidad de ampliación"},{"$f":"ListaCriterios!G215","v":"SUELO"},{"$f":"ListaCriterios!H215","v":"5.2.3.a"},{"$f":"ListaCriterios!I215","v":0},{"$f":"ListaCriterios!J215","v":"¿El PAE tiene posibilidades de ampliación?"},{"$f":"ListaCriterios!K215","v":"SI/NO"},{"$f":"IF(VLOOKUP(J215,'5.URBANISMO'!I:K,3,FALSE)=\"\",\"no_data\",VLOOKUP(J215,'5.URBANISMO'!I:K,3,FALSE))","v":"no_data"},0,5,0,0,1,0,5,0,{"$f":"ListaCriterios!O215","v":0}]
[{"$f":"ListaCriterios!A216","v":5},{"$f":"ListaCriterios!B216","v":"Urbanismo"},{"$f":"ListaCriterios!C216","v":"5.2"},{"$f":"ListaCriterios!D216","v":"Emplazamiento"},{"$f":"ListaCriterios!E216","v":"5.2.4"},{"$f":"ListaCriterios!F216","v":"Equipamientos, Zonas verdes y Servicios Técnicos"},{"$f":"ListaCriterios!G216","v":"SUELO"},{"$f":"ListaCriterios!H216","v":"5.2.4.a"},{"$f":"ListaCriterios!I216","v":0},{"$f":"ListaCriterios!J216","v":"¿Se han cumplido y todavía están disponibles las reservas urbanísticas por equipamientos y servicios técnicos?"},{"$f":"ListaCriterios!K216","v":"SI/NO"},{"$f":"IF(VLOOKUP(J216,'5.URBANISMO'!I:K,3,FALSE)=\"\",\"no_data\",VLOOKUP(J216,'5.URBANISMO'!I:K,3,FALSE))","v":"no_data"},0,5,0,0,1,0,5,0,{"$f":"ListaCriterios!O216","v":0}]
[{"$f":"ListaCriterios!A217","v":5},{"$f":"ListaCriterios!B217","v":"Urbanismo"},{"$f":"ListaCriterios!C217","v":"5.2"},{"$f":"ListaCriterios!D217","v":"Emplazamiento"},{"$f":"ListaCriterios!E217","v":"5.2.5"},{"$f":"ListaCriterios!F217","v":"Equipamientos, Zonas verdes y Servicios Técnicos"},{"$f":"ListaCriterios!G217","v":"SUELO"},{"$f":"ListaCriterios!H217","v":"5.2.5.b"},{"$f":"ListaCriterios!I217","v":0},{"$f":"ListaCriterios!J217","v":"Grado de adecuación de Zonas Verdes y de Equipamientos previstos por el planteamiento urbanístico"},{"$f":"ListaCriterios!K217","v":"Grad 1-5"},{"$f":"IF(VLOOKUP(J217,'5.URBANISMO'!I:K,3,FALSE)=\"\",\"no_data\",VLOOKUP(J217,'5.URBANISMO'!I:K,3,FALSE))","v":"no_data"},0,5,0,0,1,0,5,0,{"$f":"ListaCriterios!O217","v":0}]
[null,null,null,null,null,null,null,null,null,null,null,null,null,null,null,null,null,{"$f":"SUM(R2:R217)","v":0},{"$f":"SUM(S2:S217)","v":2265}]

{"sheet":"ListasValidación","index":16,"n_rows":53,"n_cols":7,"rows_kept":53,"cut":false,"hidden":true,"merged":[]}
["llista_departament","llista_SiNo","llista_1-5","llista_0-5"]
["Via pública","Sí",1,0]
["Medi Ambient","No",2,1]
["Promoció econòmica",null,3,2]
["Policia i protecció civil",null,4,3]
["Urbanisme",null,5,4]
["Associació o entitat de gestió",null,null,5]
[]
[]
["Aquestes llistes no s'actualitzen automàticament. Ara estan dins dels missatges d'entrada"]
["llista_zero_waste"]
["1.Cap"]
["2.Només subscripció dels objectius"]
["3.Alguna iniciativa general en materia de minimització"]
["4.Programa definit en materia Residu Zero, però accions limitades"]
["5.Polítiques actives en execució pel foment del Residu Zero"]
[]
["llista_papereres"]
["1.No suficients o en mal estat"]
["2.Suficients, estat millorable i en tot el PAE"]
["3.Suficients, estat correcte i en tot el PAE"]
["4. Correcte i només en zones que ho requereixen"]
["5. Papereres de rec.selectiva i només en zones d'ús de persones"]
[]
["llista_xxss","llista_consums","llista_comunitat","Coneixement_activitats","llista_servei_simbiosi","Xarxes","de 0 a 100%"]
["1.Sense perfil","1.No","1.No","1.No es coneix","1.No","1.No","1. 0%"]
["2.Amb perfil però sense activitat","2.Estimacions de consum industrial a nivell municipal o comarcal","2.Buscant finançament per estudi","2.Cens no actualitzat de noms d'empreses","2.Projecte a nivell local o territorial","2.Projectada o en estudi","2. del 10% al 30%"]
["3.Activitat molt limitada","3.Estimacions de consum a nivell de PAE","3.En estudi","3.Cens d'empreses (parcial o no actualitzat)","3.Projecte a nivell de PAE","3.Parcial (menys 25% del PAE)","3. del 31% al 50%"]
["4.Activitat freqüent","4.Aproximacions amb algunes informacions reals d'empreses/sectors","4.Projecte realitzat. Pendent de creació i posada en marxa","4.Cens d'empreses total amb info. Mercantil i d'activitat","4.Projecte iniciat i en procés de creació del servei","4.Parcial (més del 25% del PAE)","4. del 51% al 75%"]
["5.Amb gestor de xarxes","5.Es coneix el consum real i/o se'n fa el seguiment","5.Creada i operativa","5.Base de dades actualitzada de totes les empreses","5.Amb oficina que ofereix servei de promoció de simbiosi industrial pel PAE","5.A tot el PAE","5. 100%"]
[]
[null,null,"Titularitat","Estat planejament","Proximitat","de 0 a 40%","General Gens-Correcte"]
[null,null,"1. 100% privada","1.No tramitat","1.  >8 Km","1. 0%","1. Amb problemes greus"]
[null,null,"2. Aprox 50-50","2.En tràmit","2.  de 4 - 8 Km","2. de 1 a 10%","2. Parcial i/o amb deficiències"]
[null,null,"3. Maj. Pública","3.Definitiu, Gestió no iniciada","3. de 2 - 4 Km","3. de 11 a 20%","3. Deficient. En procés de millora"]
[null,null,"4. 100% pública, sense servei de promoció","4.Definitiu, Gestió en tràmit","4. de 0,5 - 2 Km","4. de 21 a 30%","4. Sense deficiències"]
[null,null,"5. 100% pública amb servei de promoció","5.Definitiu, Gestió registrada","5. < 0,5 Km","5. >30%","5. Correcte i actualitzat"]
[]
["Mida parcel·les"]
["1. Petites o molt petites (<3000m2), sense possibles modificacio",null,null,"Edat mitjana","Capactiat ampliació","de 0 a 100% a partir de 25%","Materials xarxa"]
["2. Parceles molt grans >20.000m2",null,null,"1. Anterior a 1960","1.Nula","1. 25%","1. Materials de xarxa perjudicials per la salut"]
["3. Heterogeni, però amb normativa molt rígida. ",null,null,"2. Entre 1960 i 1975","2.Mínima","2. del 26% al 50%","2. Materials no d'acord a normativa"]
["4. Variable. Petites (<3000), Mitjanes (<10000) i alguna gran >20.000. Sense possible fusió o divisió",null,null,"3. Entre 1975 i 1990","3.Suficient per les necessitats actuals","3. del 51% al 70%","3. Entre 50%-75%  d'acord a normativa"]
["5. Amb gran flexibilitat de dimensions. Adaptable",null,null,"4. Entre 1990 i 2010","4.Suficient per les potencials necessitats futures","4. del 71% al 85%","4. > 75% d'acord a normativa"]
[null,null,null,"5. Entre 2010 i 2020","5.Adaptable a les necessitats","5. >85%","5. 100% correcte"]
[]
["Activitats divulgatives",null,"Infraestructura avançada",null,"Qualitatiu",null,"Temps accés x.viaria"]
["1.  Cap",null,"0. No. Ni s'ha fet cap estudi",null,"Nul",null,"1. Accés a més de 15min"]
["2. Una o Dues",null,"1. No, però s'estan realitzant estudis",null,"Baix",null,"2. Entre 15 i 5 min"]
["3. Tres",null,"2. S'ha estudiat però no és viable",null,"Mitjà ",null,"3. Entre 5min i 3min"]
["4. Quatre",null,"3. Existeixen infraestructures en procés",null,"Alt",null,"4. Accés directe a través d'altre PAE"]
["5. Cinc o més",null,"4. Sí, una implantada.",null,"Màxim",null,"5. Accés directe des del PAE"]
[null,null,"5. Sí, una i més implantades o en estudi"]

{"sheet":"Llista Indicadors Avançats","index":17,"n_rows":107,"n_cols":2,"rows_kept":107,"cut":false,"hidden":true,"merged":[]}
["LLISTA D'INDICADORS AVANÇATS O POSSIBLES MILLORES"]
["AVANÇAT?","X"]
[]
["Etiquetas de fila"]
["Aspectes socials i comunicació"]
["Disponibilitat o accés a plataforma de teleformació"]
["Es té un recull d'impactes i presència de polígon o de l'entitat de gestió en els mitjans de comunicació?"]
["S'han realitzat accions, reunions o activitats amb administracions publiques del seu territori?"]
["L'assocació disposa d'estructura professionalitzada?"]
["Es té coneixement sobre necessitats o demandes de les parts interessades amb el seu corresponent tractament i anàlisi"]
["S'ha interaccionat amb entitats educatives per apropar el polígon a aquesta activitat?"]
["Activitats de divulgació i promoció de l'ocupació i l'emprenedoria entre les empreses del polígon en els últims 2 anys"]
["S'han realitzat accions en l'àmbit de la formació per a l'ocupació al polígon empresarial, d'acord amb les necessitats de les empreses?"]
["L'entitat disposa d'un programa de borsa d'ocupació o similar per a persones que busquen feina al territori?"]
["L'entitat compta amb una estratègia o política de comunicació amb objectius clars, definits i coneguts pels seus integrants?"]
["S'han promogut / participat en jornades, esdeveniments o projectes que fomentin la responsabilitat social (respecte medi ambient, igualtat gènere, insercion laboral etc.)?"]
["S'utilitza de forma clara i definida la imatge corporativa?"]
["Integració ambiental i riscos"]
["Grau d'integració del PAE al paisatge "]
["Existeix estació de mesura d'immissió de contaminats atmosfèrics?"]
["Existeix informació de proximitat disponible sobre sobre qualitat de l'aire: PST, NO2, CO, O3?"]
["S'ha realitzat un estudi de necessitat de pasos de fauna? En cas d'existir-ne o ser necessaris, son adequats?"]
["Es manté el control de perimetres de protecció/franges per control risc incendi forestal?"]
["Existeixen, en cas de ser necessaries, mesures de protecció a fauna (aus nidificants, protecció de zones especials, control de soroll, control il·luminació, etc.)?"]
["Nivell d'adeqüació del PAE per permetre el gaudi del paisatge?"]
["Es disposa d'informació sobre el Patrimoni industrial/cultural, dels seus valors i les necessitats de preservació (si és el cas)?"]
["La vialitat està construida amb asfalt sonoreductor o mesures equivalents?"]
["Es realitzen controls de soroll o existeix algun tipus de servei pel seu control?"]
["S'han realitzat estudis d'afectació a la fauna?"]
["Gestió dels recursos"]
["Es disposa d'eines per control i dades de consum d'aigua (gestor hídric)?"]
["Es disposa d'informació sobre el consum elèctric?"]
["Es disposa d'informació sobre el consum tèrmic?"]
["Es disposa d'informació sobre la producció d'energia renovable a les empreses?"]
["Es disposa d'espai per a la creació d'infraestructures per a producció d'e.renovable?"]
["Hi ha alguna comunitat energètica? "]
["Es disposa d'informació sobre el potencial de producció solar?"]
["Es disposa d'informació sobre el potencial de producció eòlic? Existeixen registres o estacio de mesura vent?"]
["S'han analitzat mesures d'eficiència per les empreses, tals com termografies (aeries o a peu pla) o assessoraments personalitats? "]
["Es té coneixement d'altres fonts difuses de GEI (CFC's, COVs…)"]
["S'ofereix assistència a les empreses per acollir-se a algun sistema de comensació d'emissions?"]
["La gestió del polígon compensa les seves emissions?"]
["Es disposa d'informació o estudis sobre els recursos materials d'entrada i sortida (matèries primeres, producció…)"]
["S'ha fet un anàlisi de l'ecosistema/metabolisme industrial?"]
["Es disposa de dades de generació de residus global del PAE?"]
["Hi ha algun tipus de política, estrategia o s'han realitzat activitats dins el concepte Zero-Waste?"]
["Es disposa d'espais reservats o disponibles per infraestructures de la gestió de residus individual o compartida?"]
["Existeixen polítiques per la implantació/promoció segons tipus d'activitats/especialització?"]
["Existeix agun servei de simbiosi industrial o equivalent?"]
["S'ha realitzat algun estudi del potencial de simbiosi industrial al PAE o al seu territori?"]
["Es realitzen accions tècniques o divulgatives que fomentin la recuperació de recursos i residus al PAE?"]
["Es coneix la quantitat de residus que es recuperen al mateix PAE?"]
["Existeixen infraestructures de producció (planta biomassa, parc solar…)?"]
["Hi ha polítiques de gestió i/o valorització compartida de residus?"]
["Infraestructures i serveis"]
["Adequació de recorreguts a peu o bicicleta"]
["Arriba cobertura de Fibra Òptica al PAE?"]
["Definició clara de responsabilitats en relació a el pla d'actuació davant d'emergències vigent"]
["Es disposa de servei mancomunat de missatgeria?"]
["Es promociona l'energia compartida des de la gestió del PAE?"]
["Es té un Pla d'emergències en versió actualitzada i amb els continguts indicats en el referencial Marca Q?"]
["Es tenen registres associats a l'manteniment de parcel·les (per exemple, neteja de mala herba, residus etc.)?"]
["Existeix alguna central de producció d'energia renovable gestionada pel PAE?"]
["Existeix alguna infraestructura del tipus: biorefineria, planta biogas, banc d'assajos de materials, EDAR específica per tipus d'aigües, …?"]
["Existeix alguna infraestructura relacionat amb l'acumulació d'energia (bateries), i/o smart grids"]
["Existeix borsa de subproductes?"]
["Existeix deixalleria industrial?"]
["Existeix la figura del gestor energètic i/o gestor ambiental?"]
["Existeix un centre físic/oficina/oficina virtual de serveis?"]
["Existeix xarxa de distribució de calor?"]
["Existeix xarxa de distribució de fred?"]
["Existeixen espais de benestar per les persones tals com gimnàs, espais d'oci, fisioteràpia…?"]
["Existeixen un servei central que centralitzi la gestió d'emergències al PAE?"]
["Hi ha cobertura mòbil d'alta velocitat 4G+, 5G?"]
["L'àrea empresarial compta amb presència de forces i cossos de seguretat o de servei de vigilància privada?"]
["S'ha estudiat la viabilitat d'una xarxa de calor/fred?"]
["S'han realitzat simulacres de posada en marxa el pla d'emergència en l'últim any? S'han posat en marxa les infraestructures d'emergència? (RECOMANACIÓ)"]
["Si no hi ha xarxes, hi ha previsió d'espai en rases per extendre-la?"]
["S'ofereix servei per ajudar a les empreses a innovar?"]
["Existeix xarxa de separativa d'aigües pluvials?"]
["Existeix xarxa de separativa d'aigües grises?"]
["Es disposa d'algun sistema de recollida per l'aprofitament d'aigües pluvials?"]
["S'ha realitzat algun estudi de necessitats/oportunitats d'infraestructures avançades (p.ex. biorefineria, planta biogas)?"]
["S'ha fet un estudi de detecció de fuites en el sistema de distribució d'aigua?"]
["Es disposa d'espais d'aparcament per a vehicles de transport de mercaderies accessibles, clarament delimitats i senyalitzats?"]
["Existeixen polítiques d'aparcament per afavorir mobilitat sostenible?"]
["Existeixen espais habilitats per a l'ús esportiu (bicicletes, patinatge, etc.) i estan adequadament senyalitzats i delimitats en condicions de seguretat per evitar accidents amb altres usuaris dels espais"]
["S'ofereixen serveis especials de finançament a les empreses? (Gestor financer)"]
["Existeix scrap-store o similar?"]
["S'ha comunicat el pla d'actuació davant d'emergències a empreses de l'àrea i tercers potencialment afectats sobre el seu contingut? Es tenen evidències d'aquestes comunicacions?"]
["Grau  de coordinació de la vigilància privada i coneixement del procediment d'actuació davant incidents"]
["Grau de funcionament i manteniment de les instal·lacions de vigilancia"]
["Es realitzen simulacres d'emergència amb periodicitat adequada i s'analitza la informació obtinguda per a la millora?"]
["Existeix alguna fotolinera al PAE?"]
["S'ofereix una central de compres en materia energètica (plaques solars, comprar verda energètica, etc)?"]
["S'ha posat en marxa o implulsat algun servei de vehicles compartits? (Carsharing, bicicletes compartides, motocicletes elèctriques, patinets…)"]
["S'ofereixen serveis per facilitar la distribució de mercaderies?"]
["S'ofereix o es promociona algun sistema o plataforma de mobilitat compartida per treballadors?"]
["Es té una relació de les parcel·les buides i ubicació en plànols?"]
["Estat de les parcel·les buides"]
["Existeixen acords  amb els titulars de les parcel·les per al seu manteniment o, si no, amb administració competent"]
["Estan les parcel·les buides tancades a l'accés a el públic?"]
["Existeix algun tipus de xarxa d'aigua regenerada?"]
["Concentració (num/1000 treballadors) de punts de recàrrega per vehicles elèctrics accessibles a treballadors i visitants"]
["La xarxa viaria al polígon està construïda amb materials d'alt índex de sostenibilitat?"]
["Es disposa de serveis logístics compartits o integrats?"]
["Total general"]

{"sheet":"Llista Indicadors per ambits","index":18,"n_rows":27,"n_cols":2,"rows_kept":27,"cut":false,"hidden":true,"merged":[]}
["NIVELL 1: GRUP","Urbanisme"]
[]
["Etiquetas de fila","NIVELL 4: PARÀMETRE/INDICADOR"]
["Característiques de les parcel·les"]
["Capacitat d’expansió d’implantacions actuals"]
["5.1.4.a","Capacitat d’expansió de les activitats actuals"]
["Grau d'ocupació dels PAE"]
["5.1.1.a","Grau d'ocupació dels PAE (%)"]
["Tipologia de les edificacions"]
["5.1.5.a","Edat promig de les edificacions actuals i necessitat de renovació"]
["Tipologia de les parcel·les"]
["5.1.3.a","Tipologia de les parcel·les segons dimensions (variabilitat, disponibilitat i flexibilitat de modificació)"]
["Titularitat de les parcel·les vacants i grau de comercialització"]
["5.1.2.a","Titularitat de les parc. vacants i grau de comercialització"]
["Emplaçament"]
["Capacitat d’ampliació"]
["5.2.3.a","El PAE té possibilitats d'ampliació?"]
["Equipaments, Zones verdes i Serveis Tècnics"]
["5.2.4.a","S'han complert i encara estan disponibles les reserves urbanístiques per equipaments i serveis tècnics? "]
["5.2.5.b","Grau d'adequació de Zones Verdes i d’Equipaments previstos pel plantejament urbanístic"]
["Estat favorable de la tramitació urbanística"]
["5.2.2.a","Estat del planejament i la seva tramitació"]
["Accés des d'Àrees Residencials"]
["5.2.1.a","Grau de proximitat a Àrees Residencials"]
["Accés des d'Àrees Industrials"]
["5.2.1.b","Grau de proximitat a altres àrees Industrials"]
["Total general"]

{"sheet":"Q de Qualitat","index":19,"n_rows":193,"n_cols":31,"rows_kept":193,"cut":false,"hidden":true,"merged":[[0,4,0,5],[4,9,4,13],[5,9,5,13],[6,9,6,13],[7,9,7,13],[2,7,2,8],[3,7,3,8],[5,7,5,8],[7,7,7,8],[8,7,8,8],[2,2,2,3],[3,2,3,3],[4,2,4,3],[5,2,5,3]]}
[null,"Versión: Febrero 2018",null,null,"MARCA DE CALIDAD PARA ÁREAS EMPRESARIALES\nPOLÍGONO EMPRESARIAL DE CALIDAD",null,"Leyenda"]
[null,null,null,null,null,null,"*VERIFICACIÓN"]
[null,"Nombre del Polígono",null,null,null,null,"Asociar documentación","Estos requisitos llevarán asociados una evidencia documental que debe estar disponible y accesible en el momento de la auditoria."]
[null,"Nombre de Entidad de gestión",null,null,null,null,"Verificar en auditoría","Estos requisitos pueden conllevar o no evidencia documental. En cualquier caso, se evidenciará en auditoría por ejemplo, a través de la visita al polígono, entrevistas con empresarios y otros implicados, u otros tipos de evidencias. "]
[null,"Fecha Auditoría",null,null,null,null,"**ESTADO: ","A cumplimentar por equipo auditor."]
[null,"Equipo auditor",null,null,null,null,"Adecuado","El estado del requisito se valora como adecuado para el tipo de área industrial en función de su tamaño, tipo de actividad y estado de desarrollo del modelo"]
[]
[null,null,null,null,null,null,"No adecuado","El estado del requisito se valora como no adecuado teniendo en cuenta el tipo de área industrial en función de su tamaño, tipo de actividad o estado de desarrollo del modelo"]
[null,"A cumplimentar en fase previa a la Auditoría in situ",null,null,null,null,"No aplica","El requisito no es de aplicación a esta área empresarial por su tipología, o por su actual estado de desarrollo"]
[]
[null,"Nº item","Nº Requisito/capítulo Especificación Marca Q","Titulo Requisito Especificación Marca Q","DESCRIPCIÓN","VERIFICACIÓN*","ESTADO**","Descripción del requisito (a cumplimentar por Entidad de gestión)","AYUDA. Ejemplos de descripción"]
[null,1,"-","Aspectos generales","¿ Se dispone de plano actualizado del polígono?","Asociar documentación",null,null,"Indicar SI/NO"]
[null,2,"-","Aspectos generales","¿Se dispone de una relación actualizada de empresas instaladas, con referencia a sector de actividad?","Asociar documentación",null,null,"Indicar SI/NO. Tipo de soporte (web, excel, papel, etc) y si incluye a todas las empresas o sólo asociadas"]
[null,3,"-","Aspectos generales","¿se tienen Estatutos de la entidad de gestión, debidamente registrados si procede?","Asociar documentación",null,null,"Indicar Si/No. Fecha de constitución de los estatutos."]
[null,4,"-","Aspectos generales","Indicar composición del órgano de gobierno de la entidad","Asociar documentación",null,null,"Nombre y cargos de las personas principales de la entidad de gestión"]
[null,5,"-","Aspectos generales","¿Se ha elaborado un plan estratégico del área? (no obligatorio)","Asociar documentación",null,null,"Indicar Si/No.Fecha y periodicidad del plan.",null,null,null,null,null,null,null,null,null,null,null,null,null,null,null,null,null,null,null,null,null,"Adecuado"]
[null,6,"2.1","Regulación Urbanística","¿Se tiene la Aprobación del Plan Parcial o Plan Especial con mención expresa en Plan General de Ordenación? ¿en ella se incluye una descripción de los usos del suelo y condiciones de edificabilidad?","Asociar documentación",null,null,"Indicar SI/No. En caso afirmativo, fecha de aprobación. Si es posible, enlace web de la publicación en boletin oficial.Indicar resumidamente uso del suelo y condiciones de edificabilidad",null,null,null,null,null,null,null,null,null,null,null,null,null,null,null,null,null,null,null,null,null,"No adecuado"]
[null,7,"2.1","Regulación Urbanística","Indicar las ordenanzas o normas urbanísticas de aplicación","Asociar documentación",null,null,"Indicar ayuntamiento, nº/titulo de la ordenanza/ reglamento.Indicar enlace web, si es posible.",null,null,null,null,null,null,null,null,null,null,null,null,null,null,null,null,null,null,null,null,null,"No aplica"]
[null,8,"2.2","Titularidad polígono","¿ se dispone de Documento de traspaso de titularidad del área empresarial o de solicitud de inicio del proceso de traspaso?","Asociar documentación",null,null,"Indicar si todas las infraestructuras están en servicio. Indicar nombre del titular del área y promotor (si fuese diferente). Indicar el Estado del proceso de traspaso,si fuese el caso."]
[null,9,"3.1.1","Red de Saneamiento","¿se dispone de Planos de la red de saneamiento?","Asociar documentación",null,null,"Indicar SI/NO"]
[null,10,"3.1.1","Red de Saneamiento","¿se tienen documentos oficiales que reflejan las principales características de la red de saneamiento (por ejemplo, pliego de condiciones técnicas de prestación del servicio)? .","Asociar documentación",null,null,"Indicar SI/NO. Indicar principales caracteristicas de la red (existencia de depuradoras, nº puntos de vertido, estado de la red, si tiene alcance todo el área, etc). Indicar si es adecuada a las necesidades del área."]
[null,11,"3.1.1","Red de Saneamiento","¿se tiene acceso a las Analíticas periódicas del vertido?","Asociar documentación",null,null,"Indicar SI/NO. Indicar si ha habido alguna incidencia relevante al respeto."]
[null,12,"3.1.1","Red de Saneamiento","¿se tiene acceso al Contrato de prestación del servicio de red de saneamiento (por ejemplo, adjudicación publica del servicio)?","Asociar documentación",null,null,"Indicar SI/NO. Indicar nombre del gestor de la red. Indicar brevemente, periodicidad del mantenimiento que se realiza y tipo de tareas que se llevan a cabo."]
[null,13,"3.1.2","Abastecimiento de agua","¿se dispone de Planos de la red de abastecimiento de agua?","Asociar documentación",null,null,"Indicar SI/NO"]
[null,14,"3.1.2","Abastecimiento de agua","¿se tienen Documentos oficiales que reflejan las principales características de la red de abastecimiento de agua (por ejemplo pliego condiciones técnicas de prestación del servicio)?","Asociar documentación",null,null,"Indicar principales caracteristicas de la red (si existen depósitos de abastecimiento, estación de tratamiento, estado de la red, alcance a todo el área, etc). Indicar si es adecuada a las necesidades del área (presión, caudal, etc)."]
[null,15,"3.1.2","Abastecimiento de agua","¿se tiene disponible analíticas periódicas sobre la potabilidad del agua de consumo","Asociar documentación",null,null,"Indicar SI/NO. Indicar si ha habido alguna incidencia relevante al respeto."]
[null,16,"3.1.2","Abastecimiento de agua","¿se tiene Contrato de prestación del servicio de abastecimiento de agua (por ejemplo, adjudicación publica del servicio)","Asociar documentación",null,null,"Indicar SI/NO. Indicar nombre del gestor de la red. Indicar brevemente, periodicidad del mantenimiento que se realiza y tipo de tareas que se llevan a cabo."]
[null,17,"3.1.3","Infraestructuras viarias","¿se tienen Documentos oficiales que reflejan las principales características de la infraestructura viaria (por ejemplo, pliego de condiciones técnicas de prestación del servicio)?","Asociar documentación",null,null,"Indicar principales caracteristicas: estado de aceras, vias, adecuación a transito de vehículos pesados y flujo de vehiculos, personas movilidad reducida, etc. Indicar si es adecuada a las necesidades del área."]
[null,18,"3.1.3","Infraestructuras viarias","¿se dispone del Contrato de prestación del servicio de mantenimiento de la infraestructura viaria (por ejemplo, adjudicación publica del servicio)?","Asociar documentación",null,null,"Indicar SI/NO. Indicar nombre del gestor de mantenimiento. Indicar brevemente, periodicidad del mantenimiento que se realiza y tipo de tareas que se llevan a cabo."]
[null,19,"3.1.4","Alumbrado público","¿se dispone de Planos de la red de alumbrado?","Asociar documentación",null,null,"Indicar SI/NO"]
[null,20,"3.1.4","Alumbrado público","¿se dispone de Documentos oficiales que reflejan las principales características de la red de alumbrado publico (por ejemplo pliego condiciones técnicas de prestación del servicio)?","Asociar documentación",null,null,"Indicar principales caracteristicas: estado y tipo de luminaria, si alcance a todo el área . Indicar si es adecuada a las necesidades del área (frecuencia, potencia, etc)."]
[null,21,"3.1.4","Alumbrado público","¿ se tiene el Contrato de prestación del servicio de alumbrado publico (por ejemplo, adjudicación publica del servicio)?","Asociar documentación",null,null,"Indicar SI/NO. Indicar nombre del gestor de mantenimiento. Indicar brevemente, periodicidad del mantenimiento que se realiza y tipo de tareas que se llevan a cabo."]
[null,22,"3.1.5","Suministro energético","¿se dispone de Planos de las redes para el suministro energético?","Asociar documentación",null,null,"Indicar SI/NO"]
[null,23,"3.1.5","Suministro energético","¿se dispone de Documentos oficiales que reflejan las principales características de la red/es de suministro energético (por ejemplo pliego condiciones técnicas de prestación del servicio)?","Asociar documentación",null,null,"Indicar principales caracteristicas de la red electrica y de gas, si es el caso."]
[null,24,"3.1.5","Suministro energético","¿Se ha elaborado material para la promoción de fuentes de energía renovables entre las empresas del área (por ejemplo, folletos, emailing, etc)?","Asociar documentación",null,null,"Indica SI/NO y en caso afirmativo describe brevemente"]
[null,25,"3.1.5","Suministro energético","¿se tiene el Contrato/s de prestación del servicio de mantenimiento suministro energético (por ejemplo, adjudicación publica del servicio)?","Asociar documentación",null,null,"Indicar SI/NO. Indicar nombre del gestor/es de mantenimiento. Indicar brevemente, periodicidad del mantenimiento que se realiza y tipo de tareas que se llevan a cabo."]
[null,26,"3.1.6","Infraestructuras telecomunicaciones","¿se dispone de Plano de canalizaciones (de ser el caso, por proveedor)?","Asociar documentación",null,null,"Indicar SI/NO"]
[null,27,"3.1.6","Infraestructuras telecomunicaciones","¿se dispone de Documentos oficiales que reflejan las principales características de la red telecomunicaciones (por ejemplo pliego condiciones técnicas de prestación del servicio)?","Asociar documentación",null,null,"Indicar nombre de proveedores disponibles. Describe brevemente sobre grado de cobertura en el área de la red movil, fibra optica etc."]
[null,28,"3.1.6","Infraestructuras telecomunicaciones","¿ se tiene el Contrato de prestación del servicio de telecomunicaciones (por ejemplo, adjudicación publica del servicio)?","Asociar documentación",null,null,"Indicar SI/NO"]
[null,29,"3.1.7","Infraestructuras emergencias","¿se dispone de Plano de la red de hidrantes?","Asociar documentación",null,null,"Indicar SI/NO"]
[null,30,"3.1.7","Infraestructuras emergencias","¿se dispone de Documentos oficiales que reflejan las principales características de la red de hidrantes (por ejemplo pliego condiciones técnicas de prestación del servicio)?","Asociar documentación",null,null,"indicar tipo de hidrantes disponibles (de arqueta, de columna, etc() y si alcance a toda el área."]
[null,31,"3.1.7","Infraestructuras emergencias","¿ se tienen Registros mantenimiento que evidencien la puesta en marcha periódica y mantenimento de la red de hidrantes según establece el RD 513/2017?","Asociar documentación",null,null,"Indicar SI/NO. Indicar nombre de mantenedor autorizado y/o personal que realiza el mantenimiento de hidrantes."]
[null,32,"3.1.7","Infraestructuras emergencias","¿se tiene Contrato con organización que lleva a cabo el mantenimiento de hidrantes según la legislación vigente? ","Asociar documentación",null,null,"Indicar nombre de mantenedor autorizado que realiza el mantenimiento de hidrantes y periodicidad con la que realiza las labores de mantenimiento."]
[null,33,"3.1.8","Mantenimiento parcelas vacías","¿ se tiene una Relación de las parcelas vacías y ubicación en plano?","Asociar documentación",null,null,"Indica SI/NO "]
[null,34,"3.1.8","Mantenimiento parcelas vacías","¿ se tienen Registros asociados al mantenimiento de parcelas (por ejemplo, limpieza de maleza, residuos etc)?","Asociar documentación",null,null,"Indica SI/NO y en caso afirmativo describe brevemente"]
[null,35,"3.1.8","Mantenimiento parcelas vacías","Indicar el/los acuerdos (si existen) con el/los titulares de las parcelas para su mantenimiento o, en su defecto, con administración competente","Asociar documentación",null,null,"Indica SI/NO y en caso afirmativo describe brevemente"]
[null,36,"3.1.9","Zonas verdes y espacios de ocio","¿se tienen documentos oficiales que reflejan las principales características de zonas verdes y de ocio (por ejemplo pliego condiciones técnicas de prestación del servicio)?","Asociar documentación",null,null,"Describre brevemente las zonas verdes y de ocio y sus caracteristicas (parque verdes, areas de juego, etc)"]
[null,37,"3.1.9","Zonas verdes y espacios de ocio","¿ se tiene Contrato de prestación del servicio de jardinería y zonas verdes y de ocio (por ejemplo, adjudicación publica del servicio)?","Asociar documentación",null,null,"Indicar SI/NO. Indicar nombre del gestor de mantenimiento. Indicar brevemente, periodicidad del mantenimiento que se realiza y tipo de tareas que se llevan a cabo."]
[null,38,"3.2.1","Servicios para la movilidad","¿existen informes o propuestas para la mejora de la movilidad y/o la intermodalidad en el área? Indicar características principales en movilidad.","Asociar documentación",null,null,"Indicar SI/NO.Describe brevemente la movilidad del área: principales medios de transporte, accesos, nivel de trafico, etc."]
[null,39,"3.2.1","Servicios para la movilidad","¿existen Informes o propuestas de mejora enviadas al concesionario para el transporte público?","Asociar documentación",null,null,"Indicar SI/NO. Describe brevemente las caracteristicas del transporte publico (tipo, estaciones cercanas, nº paradas bus, etc)."]
[null,40,"3.2.2","Limpieza de zonas públicas","¿ se tiene contrato (en caso de corresponder la gestión al área) con la empresa proveedora del servicio de limpieza ?","Asociar documentación",null,null,"Indicar SI/NO. Indicar nombre de empresa de limpieza de zonas publicas. Indicar brevemente, periodicidad del mantenimiento que se realiza y tipo de tareas que se llevan a cabo."]
[null,41,"3.2.2","Limpieza de zonas públicas","¿existen Informes o propuestas de mejora enviadas al concesionario de limpieza, si los hubiera?","Asociar documentación",null,null,"Indica SI/NO y en caso afirmativo describe brevemente"]
[null,42,"3.2.3","Gestión de residuos","¿ se han elaborado Materiales para la difusión y concienciación en materia de gestión de residuos (reducción, reutilización y reciclaje)?","Asociar documentación",null,null,"Indica SI/NO y en caso afirmativo describe brevemente"]
[null,43,"3.2.3","Gestión de residuos","¿se tiene Contratos (en caso de corresponder la gestión al área) con la empresa proveedora del servicio de gestión de residuos?","Asociar documentación",null,null,"Indicar SI/NO. Indicar nombre de empresa de recogida de residuos. Indicar brevemente, periodicidad de la recogida y tipo de residuos que gestionan"]
[null,44,"3.2.3","Gestión de residuos","¿ se han elaborado Informes o propuestas de mejora enviadas al concesionario de gestión de residuos?","Asociar documentación",null,null,"Indica SI/NO y en caso afirmativo describe brevemente"]
[null,45,"3.2.3","Gestión de residuos","¿se encuentran disponibles los documentos legales asociados a la gestión de residuos(transportista/ gestor)?  (en caso de corresponder la gestión al área empresarial)","Asociar documentación",null,null,"Indica SI/NO y en caso afirmativo describe brevemente"]
[null,46,"3.2.4","Servicios para la seguridad","¿se tiene un Plan de  emergencias en versión actualizada y con los contenidos indicados en el referencial Marca Q?","Asociar documentación",null,null,"indicar SI/No. En caso negativo, ¿se está en proceso de elaboración? Describe brevemente si existe tambien planes territoriales de emergencias."]
[null,47,"3.2.4","Servicios para la seguridad","¿Se ha comunicado dicho plan de actuación ante emergencias a empresas del área y terceros potencialmente afectados sobre su contenido? ¿se tienen evidencias de esas comunicaciones?","Asociar documentación",null,null,"Indicar SI/NO. "]
[null,48,"3.2.4","Servicios para la seguridad","¿el área empresarial cuenta con presencia de fuerzas y cuerpos de seguridad o de servicio de vigilancia privada? ","Asociar documentación",null,null,"Indicar qué cuerpos de fuerzas y seguridad tienen competencias, y si existe servicio de vigilancia privada (nombre empresa y caracteristicas del servicio que presta)."]
[null,49,"3.2.4","Servicios para la seguridad","¿Se han realizado simulacros de puesta en marcha el plan de emergencia en el último año? ¿ se han puesto en marcha las infraestructuras de emergencia? (RECOMENDACIÓN)","Asociar documentación",null,null,"Indicar SI/NO. En caso afirmativo,indicad escenario del simulacro, fecha y partes involucradas."]
[null,50,"3.2.5","Promoción del área","¿ Se tiene página Web del area empresarial con información actualizada? ","Asociar documentación",null,null,"Indicar dirección web."]
[null,51,"3.2.5","Promoción del área","¿Existe información pública disponible sobre el área empresarial (localización, accesos, segregación…)? Describe brevemente.","Asociar documentación",null,null,"Describre brevemente a traves de que medio (web, portfolio, etc)"]
[null,52,"3.2.5","Promoción del área","¿Se puede acceder a Información  de forma pública o bajo demanda sobre parcelas disponibles (venta o alquiler)? Describe brevemente en qué medio.","Asociar documentación",null,null,"Describre brevemente a traves de que medio (web, portfolio, etc)"]
[null,53,"3.2.5","Promoción del área","¿ se puede acceder a Información  en relación a las empresas asentadas en el área y con facilidad de acceso a la misma? ","Asociar documentación",null,null,"Describre brevemente a traves de que medio (web, portfolio, etc)"]
[null,54,"3.2.5","Promoción del área","Indicar soportes utilizados para la promoción del área empresarial entre las partes interesadas","Asociar documentación",null,null,"Indicar a través de que medio (web, redes sociales, etc), ultimas acciones realizadas, etc."]
[null,55,"4.1","Entidad de gestión del área","¿ la entidad de gestión ha elaborado un Informe de gestión del área o memoria anual de la entidad de gestión en relación al poligono, recogiendo todos los aspectos del referencial Marca Q de Poligino industrial de Calidad?","Asociar documentación",null,null,"Indicar SI/NO. Fecha de la ultima memoria y periodicidad de la misma."]
[null,56,"4.1","Entidad de gestión del área","Indicar si la entidad de gestión dispone de Certificaciones en el área empresarial (certificaciones de calidad, medioambiente…)","Asociar documentación",null,null,"Indicar SI/NO. En caso afirmativo, tipo de certificación, fecha del vigencia del certificado y entidad certificadora."]
[null,57,"4.2","Enfoque a las empresas del área","¿ se han realizado encuestas/estudios sobre necesidades y valoraciones de las empresas asentadas? ","Asociar documentación",null,null,"Indicar SI/NO. Indicar aspecto evaluado y fecha de la última evaluación."]
[null,58,"4.3","Enfoque promoción del área","Indica las empresas asentadas más relevantes del área empresarial.","Asociar documentación"]
[null,59,"4.4","Sistema de gestión","Enumera las principales partes interesadas del área empresarial","Asociar documentación"]
[null,60,"4.4","Sistema de gestión","Enumera las principales necesidades y expectativas del área empresarial.","Asociar documentación"]
[null,61,"4.5","Gestión y tratamiento de incidencias","¿ se tiene una relación de incidencias en infraestructuras y servicios identificadas y existe un tratamiento de las mismas?","Asociar documentación",null,null,"Indicar SI/NO y en qué formato se tiene."]
[null,62,"4.5","Gestión y tratamiento de incidencias","¿ se tiene un canal normalizado para la gestión y el tratamiento de las incidencias detectadas en el área empresarial? Indicar cual.","Asociar documentación",null,null,"Indicar canal (web, telefono, mail, etc). El canal de comunicación debe ser tanto de los empresarios a la entidad de gestión , como de la entidad al gestor responsable de la infraestructura/servicio"]
[null,63,"5.1","Prestación de servicios de valor","Identifica los servicios de valor que presta directamente la entidad de gestión y sus condiciones","Asociar documentación",null,null,"Enumera los servicios prestados directamente por la entidad de gestión. Cada uno debe llevar asociado un contrato/convenio con condiciones del servicio prestado"]
[null,64,"5.1","Prestación de servicios de valor","Identifica los servicios de valor prestados por terceros ","Asociar documentación",null,null,"Enumera los servicios prestados por terceros para las empresas del área de gestión"]
[null,65,"5.1","Prestación de servicios de valor","¿se ha elaborado una carta de servicios con todos los servicios y condiciones de los mismo? (recomendable)","Asociar documentación",null,null,"Indicar SI/NO. Si es publica,indicar link para descarga"]
[null,66,"5.1","Prestación de servicios de valor","¿ los servicios de valor y sus condiciones son públicos y están  disponible y accesible la información de los mismos?","Asociar documentación",null,null,"Indica SI/NO. Indicar web o similar a través de donde son ofertados."]
[null,67,"5.2","Evaluación de servicios de valor","¿ se ha evaluado la eficacia de los servicios de valor prestados directamente por la entidad de gestión? ","Asociar documentación",null,null,"Indicar SI/NO."]
[null,68,"5.3","Seguimiento mejora Servicios valor","¿Se dispone de un canal normalizado para dirigir las incidencias y mejoras relacionadas con los servicios de valor?","Asociar documentación",null,null,"Indicar SI/No y cuál es el canal. "]
[null,69,"5.4","Socios clave","¿se tiene una relación con los socios clave para el área empresarial? Enumere los socios clave del área.","Asociar documentación",null,null,"Enumere los socios clave del área y cual es el servicio de valor que prestan a las empresas"]
[null,70,"5.5","Otros servicios de valor accesibles","Enumere otros servicios de valor que se prestan en el área empresarial o cerca de él (ver ejemplos en el referencial).","Asociar documentación",null,null,"Ej. Oficinas bancarias, correos, mensajeria, guarderias,residencias mayores, instalaciones de ocio y deporte, etc."]
[null,71,"6.1","Influencia social. Liderazgo","¿ se han realizado acciones, reuniones o actividades con partes interesadas de su territorio? ","Asociar documentación",null,null,"Indicar SI/NO. Enumere las principales actuaciones en los ultimos meses"]
[null,72,"6.2","Influencia social. Partes interesadas","¿ se han realizado acciones, reuniones o actividades con administraciones publicas de su territorio? ","Asociar documentación",null,null,"Indicar SI/NO. Enumere las principales actuaciones en los ultimos meses"]
[null,73,"6.2","Influencia social. Partes interesadas","¿ se han realizado acciones, reuniones o actividades con entidades de formación de su territorio? ","Asociar documentación",null,null,"Indicar SI/NO. Enumere las principales actuaciones en los ultimos meses"]
[null,74,"6.2","Influencia social. Partes interesadas","¿ se han realizado acciones, reuniones o actividades con empresas del área/ titulares de parcelas? ","Asociar documentación",null,null,"Indicar SI/NO. Enumere las principales actuaciones en los ultimos meses"]
[null,75,"6.2","Influencia social. Partes interesadas","¿ se han realizado acciones, reuniones o actividades con entidades sociales (asociaciones, sindicatos, vecinales, etc? ","Asociar documentación",null,null,"Indicar SI/NO. Enumere las principales actuaciones en los ultimos meses"]
[null,76,"6.3","Influencia social. Apoyo empleo","¿se dispone de bolsa de empleo o similar de acceso público online ?","Asociar documentación",null,null,"Indicar SI/NO"]
[null,77,"6.4","Influencia social. Comunicación","¿el área empresarial tiene una imagen corporativa (logo) del área empresarial?","Asociar documentación",null,null,"Indicar SI/NO"]
[null,78,"6.4","Influencia social. Comunicación","¿ se tiene una recopilación de impactos y presencia del polígono o de la entidad de gestión en los medios de comunicación? ","Asociar documentación",null,null,"Indicar SI/NO. Indicar medios en los que se ha hablado del polígono."]
[null,79,"6.4","Influencia social. Comunicación","¿ se tiene presencia en redes sociales? Indique en cuales.","Asociar documentación",null,null,"Indicar SI/NO. Indicar link al perfil de la red social."]
[null,80,"6.5","Influencia social. RSE","¿ se han promovido/participado en jornadas, eventos o proyectos que fomenten la responsabilidad social (respeto medio ambiente, igualdad genero, insercion laboral etc.)","Asociar documentación",null,null,"Indicar SI/NO. Enumere las principales actuaciones en los ultimos meses"]
[null,81,"6.6","Influencia social. Colaboración","¿se dispone de acuerdos o convenios de colaboración/adhesión con otras entidades de gestión de áreas empresariales para el desarrollo de acciones de interés para el polígono o para el desarrollo de sinergias?","Asociar documentación",null,null,"Indicar SI/NO. Enumere las principales actuaciones en los ultimos meses"]
[]
[null,82,"2.2","Titularidad polígono","Infraestructuras completamente en servicio (o al menos de las fases urbanizadas)","Verificar en auditoría"]
[null,83,"3.1.1","Red de saneamiento","Esta infraestructura es adecuadas al tipo de área","Verificar en auditoría"]
[null,84,"3.1.1","Red de saneamiento","Alcanza a todo el territorio del área empresarial","Verificar en auditoría"]
[null,85,"3.1.1","Red de saneamiento","Desagua en depuradora o en red que conduce a esta","Verificar en auditoría"]
[null,86,"3.1.1","Red de saneamiento","Esta infraestructura está completamente en servicio","Verificar en auditoría"]
[null,87,"3.1.1","Red de saneamiento","(en caso de ser específica del área) La EDAR funciona correctamente y se mantiene de forma adecuada","Verificar en auditoría"]
[null,88,"3.1.1","Red de saneamiento","La capacidad de depuración es adecuada a la tipología y volumen de empresas del área","Verificar en auditoría"]
[null,89,"3.1.2","Abastecimiento de agua","Esta infraestructura está completamente en servicio","Verificar en auditoría"]
[null,90,"3.1.2","Abastecimiento de agua","Esta infraestructura es adecuadas al tipo de área","Verificar en auditoría"]
[null,91,"3.1.2","Abastecimiento de agua","Alcanza a todo el territorio del área empresarial","Verificar en auditoría"]
[null,92,"3.1.2","Abastecimiento de agua","El caudal es adecuado a las necesidades del área","Verificar en auditoría"]
[null,93,"3.1.2","Abastecimiento de agua","(En caso de existir depósitos para abastecimiento) Los depósitos se encuentran bien conservados y limpios","Verificar en auditoría"]
[null,94,"3.1.2","Abastecimiento de agua","(En caso de existir depósitos para abastecimiento) El acceso a los depósitos se restringe a las personas autorizadas","Verificar en auditoría"]
[null,95,"3.1.2","Abastecimiento de agua","En caso de competencia exclusiva del área, materiales empleados adecuados y cumplimiento legislación vigente.","Verificar en auditoría"]
[null,96,"3.1.3","Infraestructuras viarias","Esta infraestructura está completamente en servicio","Verificar en auditoría"]
[null,97,"3.1.3","Infraestructuras viarias","Las condiciones de conservación de la plataforma de rodadura, aceras y señalización con adecuadas a su uso","Verificar en auditoría"]
[null,98,"3.1.3","Infraestructuras viarias","La señalización horizontal y vertical es coherente y permite la circulación en condiciones de seguridad de acuerdo al entorno","Verificar en auditoría"]
[null,99,"3.1.3","Infraestructuras viarias","(En caso necesario) los cuadros y cajas de conexiones de señalización electrónica se encuentran cerrados y en buen estado","Verificar en auditoría"]
[null,100,"3.1.3","Infraestructuras viarias","(En función de la tipología) existen aceras de tamaño suficiente para permitir el flujo previsible de peatones en condiciones de seguridad","Verificar en auditoría"]
[null,101,"3.1.3","Infraestructuras viarias","Condiciones de accesibilidad para las personas con movilidad reducida","Verificar en auditoría"]
[null,102,"3.1.3","Infraestructuras viarias","Señalización y visibilidad de pasos de peatones","Verificar en auditoría"]
[null,103,"3.1.3","Infraestructuras viarias","Rebajas de cota en las aceras o pasos sobreelevados","Verificar en auditoría"]
[null,104,"3.1.3","Infraestructuras viarias","(en función del área) Existe mobiliario urbano (bancos, papeleras etc) adecuado y no dificulta el tránsito","Verificar en auditoría"]
[null,105,"3.1.3","Infraestructuras viarias","Dimensión de la red viaria adecuada al flujo previsible de vehículos particulares","Verificar en auditoría"]
[null,106,"3.1.3","Infraestructuras viarias","Existe aparcamiento de forma que los vehículos particulares estacionados no interfieren las condiciones de seguridad y fluidez de transito","Verificar en auditoría"]
[null,107,"3.1.3","Infraestructuras viarias","Accesos y viales dimensionados para permitir transito y maniobra de vehículos industriales, en función de necesidades del área","Verificar en auditoría"]
[null,108,"3.1.3","Infraestructuras viarias","Consistencia de la plataforma de circulación adecuada al peso de vehículos industriales, conforme a las necesidades del área","Verificar en auditoría"]
[null,109,"3.1.3","Infraestructuras viarias","Las acciones de comunicación y publicidad del área hacen referencia veraz a esta capacidad de movilidad de vehículos ","Verificar en auditoría"]
[null,110,"3.1.3","Infraestructuras viarias","Disponibilidad de espacios para el aparcamiento o parada de vehículos pesados en condiciones de seguridad","Verificar en auditoría"]
[null,111,"3.1.4","Alumbrado público","Adecuado estado de conservación, sin cableado al aire en cajas de conexiones y cuadros eléctricos públicos","Verificar en auditoría"]
[null,112,"3.1.4","Alumbrado público","Garantizada la adecuada visibilidad durante el horario de actividad habitual, conforme las circunstancias del entorno","Verificar en auditoría"]
[null,113,"3.1.4","Alumbrado público","De ser requerido, existen elementos de alumbrado en zonas que requieren de visibilidad (paradas de transporte público…)","Verificar en auditoría"]
[null,114,"3.1.4","Alumbrado público","Existe un protocolo definido con el titular de la infraestructura y este se cumple","Verificar en auditoría"]
[null,115,"3.1.5","Suministro energético","Adecuado estado de conservación de la red/redes de suministro energético","Verificar en auditoría"]
[null,116,"3.1.5","Suministro energético","Red/es de suministro energético adecuadamente dimensionadas y ser capaces de suministrar suficiente energía a todas las parcelas","Verificar en auditoría"]
[null,117,"3.1.6","Infraestructuras telecomunicaciones","Adecuado estado de conservación de elementos visibles de la red de comunicaciones. Especialmente, en su caso, las casetas o cajas de conexiones","Verificar en auditoría"]
[null,118,"3.1.6","Infraestructuras telecomunicaciones","Existe cobertura para servicios móviles en toda el área","Verificar en auditoría"]
[null,119,"3.1.6","Infraestructuras telecomunicaciones","Las antenas repetidoras de señal en zonas públicas (en su caso) están señalizadas y con acceso controlado","Verificar en auditoría"]
[null,120,"3.1.6","Infraestructuras telecomunicaciones","Las información sobre las características de la red aparecen reflejadas adecuadamente en la publicidad del área","Verificar en auditoría"]
[null,121,"3.1.6","Infraestructuras telecomunicaciones","Evidencia de incidencias graves en la infraestructura","Verificar en auditoría"]
[null,122,"3.1.7","Infraestructuras emergencias","Existe red de hidrantes y está en buen estado de conservación","Verificar en auditoría"]
[null,123,"3.1.7","Infraestructuras emergencias","La señalización de las tomas de la red de hidrantes es adecuada para asegurar que no se obstruyen y son funcionales","Verificar en auditoría"]
[null,124,"3.1.7","Infraestructuras emergencias","Existe un punto de encuentro en una ubicación segura dentro del área empresarial, señalizado y accesible","Verificar en auditoría"]
[null,125,"3.1.7","Infraestructuras emergencias","La señalización permite un adecuado desalojo en caso necesario","Verificar en auditoría"]
[null,126,"3.1.7","Infraestructuras emergencias","Evidencias de realización de simulacros o pruebas a la red de emergencias, y de adecuación de esta a las necesidades del área","Verificar en auditoría"]
[null,127,"3.1.8","Mantenimiento parcelas vacías","Adecuado estado de las parcelas vacías","Verificar en auditoría"]
[null,128,"3.1.8","Mantenimiento parcelas vacías","Parcelas vacías cerradas el acceso al publico","Verificar en auditoría"]
[null,129,"3.1.9","Zonas verdes y espacios de ocio","Adecuado estado de conservación y mantenimiento de zonas verdes y espacios de ocio","Verificar en auditoría"]
[null,130,"3.1.9","Zonas verdes y espacios de ocio","Accesibilidad de zonas verdes y espacios de ocio, sin barreras arquitectónicas y acceso en condiciones de seguridad","Verificar en auditoría"]
[null,131,"3.1.9","Zonas verdes y espacios de ocio","Los espacios habilitados para cada tipo de usuario (por edades, por finalidad, animales,etc....) deben estartán adecuadamente delimitados e identificados, así como las normas de uso seguro de las instalaciones asignadas a cada uno de ellos","Verificar en auditoría"]
[null,132,"3.1.9","Zonas verdes y espacios de ocio","Los espacios habilitados para el uso deportivo  (bicicletas, patinaje, etc.) deben estarán adecuadamente señalizados y delimitados en condiciones de seguridad para evitar accidentes con otros usuarios de los espacios","Verificar en auditoría"]
[null,133,"3.1.9","Zonas verdes y espacios de ocio","Existe información visible con los datos de contacto en caso de incidentes","Verificar en auditoría"]
[null,134,"3.2.1","Servicios para la movilidad","Proximidad, accesibilidad y estado de conservación de paradas de transporte público adecuado","Verificar en auditoría"]
[null,135,"3.2.1","Servicios para la movilidad","Información disponible sobre el transporte público (líneas, recorridos, frecuencias…)","Verificar en auditoría"]
[null,136,"3.2.1","Servicios para la movilidad","Desarrollo de acciones (en su caso) para la optimizacion de los flujos de tráfico, coordinando sistemas privados de transporte","Verificar en auditoría"]
[null,137,"3.2.1","Servicios para la movilidad","Espacios de aparcamiento para vehículos particulares accesibles, claramente delimitados y señalizados","Verificar en auditoría"]
[null,138,"3.2.1","Servicios para la movilidad","Espacios de aparcamiento para vehículos de transporte de mercancias accesibles, claramente delimitados y señalizados","Verificar en auditoría"]
[null,139,"3.2.1","Servicios para la movilidad","Información sobre transporte público en las acciones de difusión y propaganda del área","Verificar en auditoría"]
[null,140,"3.2.1","Servicios para la movilidad","Plano con directorio de empresas disponible (físico u online). En caso de ser físico, con espacio para la parada segura","Verificar en auditoría"]
[null,141,"3.2.1","Servicios para la movilidad","Información previa sobre localización de empresas a través de medios telemáticos","Verificar en auditoría"]
[null,142,"3.2.1","Servicios para la movilidad","Las señalización (horizontal y vertical) se mantiene en condiciones de clara visibilidad","Verificar en auditoría"]
[null,143,"3.2.1","Servicios para la movilidad","Las vías de salida y evacuación del área empresarial están claramente señalizadas","Verificar en auditoría"]
[null,144,"3.2.2","Limpieza de zonas públicas","Adecuado estado de limpieza de las zonas públicas del área empresarial","Verificar en auditoría"]
[null,145,"3.2.2","Limpieza de zonas públicas","Adecuado estado de conservación de las zonas verdes dentro del área empresarial","Verificar en auditoría"]
[null,146,"3.2.2","Limpieza de zonas públicas","Períodos de prestación del servicio adecuados a la tipología del área y a las necesidades de las empresas","Verificar en auditoría"]
[null,147,"3.2.3","Gestión de residuos","Contenedores y papeleras en número y estado de conservación adecuado a las necesidades del área","Verificar en auditoría"]
[null,148,"3.2.4","Servicios para la seguridad","Definición clara de responsabilidades en relación al plan de actuación ante emergencias vigente","Verificar en auditoría"]
[null,149,"3.2.4","Servicios para la seguridad","Si se realizan, la relación de simulacros con periodicidad adecuada y análisis de la información obtenida para la mejora","Verificar en auditoría"]
[null,150,"3.2.4","Servicios para la seguridad","Coordinación de la vigilancia privada y conocimiento del procedimiento de actuación ante incidentes","Verificar en auditoría"]
[null,151,"3.2.4","Servicios para la seguridad","En caso de utilizar vídeo vigilancia, el mantenimiento de las instalaciones es adecuado y se advierte mediante la señalización requerida ","Verificar en auditoría"]
[null,152,"3.2.5","Promoción del área","Existe un canal de comunicación con potenciales interesados para que puedan obtener la información de su interés sobre el área","Verificar en auditoría"]
[null,153,"3.2.5","Promoción del área","Evidencias de búsqueda activa de oportunidades de mejora en el ámbito de promoción del área empresarial","Verificar en auditoría"]
[null,154,"4.1","Entidad de gestión del área","La entidad de gestión cuenta con personal para la realización de las actividades de gestión diarias","Verificar en auditoría"]
[null,155,"4.1","Entidad de gestión del área","Las empresas asentadas reconocen a la entidad de gestión como representante e interlocutor","Verificar en auditoría"]
[null,156,"4.2","Enfoque a las empresas del área","La opinión de las empresas asentadas en el área es tenida en cuenta en los proceso de decisión de la entidad de gestión","Verificar en auditoría"]
[null,157,"4.2","Enfoque a las empresas del área","Se han definido sistemáticas y canales de comunicación para permitir la participación consciente de las empresas","Verificar en auditoría"]
[null,158,"4.2","Enfoque promoción del área","Iniciativas para la promoción del área empresarial entre partes interesadas","Verificar en auditoría"]
[null,159,"4.5","Tratamiento de incidencias","Existe un canal de comunicación con las empresas en relación a incidencias","Verificar en auditoría"]
[null,160,"4.5","Tratamiento de incidencias","Existe procedimiento para el registro y tratamiento de incidencias","Verificar en auditoría"]
[null,161,"5.1","Prestación de servicios de valor","Evidencias de la identificación y priorizacion de servicios de valor por la importancia dada por las empresas","Verificar en auditoría"]
[null,162,"5.1","Prestación de servicios de valor","La entidad transmite a las empresas del polígono los acuerdos con el detalle suficiente y atiende a las consultas de las mismas","Verificar en auditoría"]
[null,163,"5.1","Prestación de servicios de valor","Seguimiento de los servicios de valor prestados y de las entidades que los prestan","Verificar en auditoría"]
[null,164,"5.1","Prestación de servicios de valor","Evidencias de búsqueda activa de oportunidades de mejora en el ámbito de los servicios de valor","Verificar en auditoría"]
[null,165,"6.1","Influencia social. Liderazgo","Evidencias de reuniones o contactos informativos realizados con partes interesadas de su territorio","Verificar en auditoría"]
[null,166,"6.1","Influencia social. Liderazgo","Evidencias de proyectos realizados con partes interesadas de su territorio","Verificar en auditoría"]
[null,167,"6.1","Influencia social. Liderazgo","Evidencias de actividades divulgativas realizadas por la entidad de gestión en su territorio","Verificar en auditoría"]
[null,168,"6.2","Influencia social. Partes interesadas","Conocimiento sobre necesidades o demandas de las partes interesadas con su correspondiente tratamiento y análisis","Verificar en auditoría"]
[null,169,"6.2","Influencia social. Partes interesadas","Evidencias de interrelación, sensibilización o de dinamización del ámbito de la educación reglada en el polígono empresarial","Verificar en auditoría"]
[null,170,"6.2","Influencia social. Partes interesadas","Evidencias de interacción con entidades educativas para acercar el polígono a dicha actividad","Verificar en auditoría"]
[null,171,"6.2","Influencia social. Partes interesadas","Evidencias de actividades de sensibilización, información o de mejora de la conservación de las parcelas del polígono","Verificar en auditoría"]
[null,172,"6.3","Influencia social. Apoyo empleo","Evidencias de interrelación, sensibilización o dinamización del ámbito del empleo y el emprendimiento en el área","Verificar en auditoría"]
[null,173,"6.3","Influencia social. Apoyo empleo","Actividades de divulgación y promoción del empleo y el emprendimiento entre las empresas del polígono","Verificar en auditoría"]
[null,174,"6.3","Influencia social. Apoyo empleo","Evidencias en relación al ámbito de la formación para el empleo en el polígono empresarial, acorde a las necesidades de las empresas","Verificar en auditoría"]
[null,175,"6.3","Influencia social. Apoyo empleo","Disponibilidad o acceso a plataforma de teleformación","Verificar en auditoría"]
[null,176,"6.3","Influencia social. Apoyo empleo","La entidad dispone de un programa de bolsa de empleo o similar para personas que buscan empleo en el territorio","Verificar en auditoría"]
[null,177,"6.4","Influencia social. Comunicación","La entidad cuenta con una estrategia o política de comunicación con objetivos claros, definidos y conocidos por sus integrantes","Verificar en auditoría"]
[null,178,"6.4","Influencia social. Comunicación","Evidencias de la utilización clara y definida de la imagen corportativa","Verificar en auditoría"]
[null,179,"6.4","Influencia social. Comunicación","Evidencias de la gestión y uso de perfiles en redes sociales","Verificar en auditoría"]
[null,180,"6.4","Influencia social. Comunicación","Evidencias de acciones periódicas de revisión y mejora de la estrategia de comunicación","Verificar en auditoría"]
[null,181,"6.6","Influencia social. Colaboración","Evidencias de la participación de la entidad de gestión en eventos, jornadas o grupos de trabajo en materia de dinamización de áreas empresariales","Verificar en auditoría"]

{"sheet":"DINAMICA-Q","index":20,"n_rows":14,"n_cols":3,"rows_kept":14,"cut":false,"hidden":true,"merged":[]}
[]
[]
["Etiquetas de fila","TEMA","DADES A OBTENIR"]
["3.1.6"]
["Infraestructuras telecomunicaciones"]
["¿ se tiene el Contrato de prestación del servicio de telecomunicaciones (por ejemplo, adjudicación publica del servicio)?"]
["¿se dispone de Documentos oficiales que reflejan las principales características de la red telecomunicaciones (por ejemplo pliego condiciones técnicas de prestación del servicio)?"]
["¿se dispone de Plano de canalizaciones (de ser el caso, por proveedor)?"]
["Adecuado estado de conservación de elementos visibles de la red de comunicaciones. Especialmente, en su caso, las casetas o cajas de conexiones"]
["Evidencia de incidencias graves en la infraestructura"]
["Existe cobertura para servicios móviles en toda el área"]
["Las antenas repetidoras de señal en zonas públicas (en su caso) están señalizadas y con acceso controlado"]
["Las información sobre las características de la red aparecen reflejadas adecuadamente en la publicidad del área"]
["Total general"]

{"sheet":"Dinamica_VECTORS","index":21,"n_rows":55,"n_cols":1,"rows_kept":55,"cut":false,"hidden":true,"merged":[]}
["ASPECTES ORDENATS PER VECTORS"]
[]
["Etiquetas de fila"]
["AIGUA"]
["Aigua"]
["Infraestructures avançades"]
["Infraestructures bàsiques"]
["COL·LABORACIÓ"]
["Associacionisme"]
["Col·laboració"]
["Infraestructures avançades"]
["Serveis avançats i/o compartits"]
["ENERGIA I CANVI CLIMATIC"]
["Emissions atmosfèriques"]
["Energia i canvi climàtic"]
["Infraestructures avançades"]
["Infraestructures bàsiques"]
["Serveis avançats i/o compartits"]
["MATERIALS"]
["Materia primera i producció"]
["Simbiosi industrial"]
["MOBILITAT"]
["Emplaçament"]
["Infraestructures avançades"]
["Infraestructures bàsiques"]
["Serveis avançats i/o compartits"]
["Serveis bàsics"]
["QUALITAT DE L'ESPAI"]
["Contaminació lluminosa"]
["Infraestructures bàsiques"]
["Medi natural"]
["Paisatge"]
["Serveis avançats i/o compartits"]
["Serveis bàsics"]
["Soroll"]
["RESIDUS"]
["Residus"]
["Serveis avançats i/o compartits"]
["Simbiosi industrial"]
["SEGURETAT"]
["Infraestructures bàsiques"]
["Inundabilitat"]
["Medi natural"]
["Serveis avançats i/o compartits"]
["SOCIAL"]
["Ocupació i formació"]
["Promoció"]
["SÒL"]
["Característiques de les parcel·les"]
["Emplaçament"]
["TELECOMUNICACIONS"]
["Infraestructures bàsiques"]
["(en blanco)"]
["(en blanco)"]
["Total general"]